{
  "data_qualities": {
    "quality": [
      {
        "name": "AutoCorrelation",
        "value": "0.6307385229540918"
      },
      {
        "name": "Dimensionality",
        "value": "4.6713096653643624E-4"
      },
      {
        "name": "MajorityClassPercentage",
        "value": []
      },
      {
        "name": "MajorityClassSize",
        "value": []
      },
      {
        "name": "MinorityClassPercentage",
        "value": []
      },
      {
        "name": "MinorityClassSize",
        "value": []
      },
      {
        "name": "NumberOfBinaryFeatures",
        "value": "3.0"
      },
      {
        "name": "NumberOfClasses",
        "value": "0.0"
      },
      {
        "name": "NumberOfFeatures",
        "value": "11.0"
      },
      {
        "name": "NumberOfInstances",
        "value": "23548.0"
      },
      {
        "name": "NumberOfInstancesWithMissingValues",
        "value": "0.0"
      },
      {
        "name": "NumberOfMissingValues",
        "value": "0.0"
      },
      {
        "name": "NumberOfNumericFeatures",
        "value": "4.0"
      },
      {
        "name": "NumberOfSymbolicFeatures",
        "value": "7.0"
      },
      {
        "name": "PercentageOfBinaryFeatures",
        "value": "27.27272727272727"
      },
      {
        "name": "PercentageOfInstancesWithMissingValues",
        "value": "0.0"
      },
      {
        "name": "PercentageOfMissingValues",
        "value": "0.0"
      },
      {
        "name": "PercentageOfNumericFeatures",
        "value": "36.36363636363637"
      },
      {
        "name": "PercentageOfSymbolicFeatures",
        "value": "63.63636363636363"
      }
    ]
  }
}