{
  "data_features": {
    "feature": [
      {
        "data_type": "numeric",
        "index": "0",
        "is_ignore": "false",
        "is_row_identifier": "false",
        "is_target": "false",
        "name": "Upper_Age",
        "number_of_missing_values": "0"
      },
      {
        "data_type": "numeric",
        "index": "1",
        "is_ignore": "false",
        "is_row_identifier": "false",
        "is_target": "false",
        "name": "Lower_Age",
        "number_of_missing_values": "0"
      },
      {
        "data_type": "numeric",
        "index": "2",
        "is_ignore": "false",
        "is_row_identifier": "false",
        "is_target": "false",
        "name": "Reco_Policy_Premium",
        "number_of_missing_values": "0"
      },
      {
        "data_type": "nominal",
        "index": "3",
        "is_ignore": "false",
        "is_row_identifier": "false",
        "is_target": "false",
        "name": "City_Code",
        "nominal_value": [
          "C1",
          "C10",
          "C11",
          "C12",
          "C13",
          "C14",
          "C15",
          "C16",
          "C17",
          "C18",
          "C19",
          "C2",
          "C20",
          "C21",
          "C22",
          "C23",
          "C24",
          "C25",
          "C26",
          "C27",
          "C28",
          "C29",
          "C3",
          "C30",
          "C31",
          "C32",
          "C33",
          "C34",
          "C35",
          "C36",
          "C4",
          "C5",
          "C6",
          "C7",
          "C8",
          "C9"
        ],
        "number_of_missing_values": "0"
      },
      {
        "data_type": "nominal",
        "index": "4",
        "is_ignore": "false",
        "is_row_identifier": "false",
        "is_target": "false",
        "name": "Accomodation_Type",
        "nominal_value": [
          "Owned",
          "Rented"
        ],
        "number_of_missing_values": "0"
      },
      {
        "data_type": "nominal",
        "index": "5",
        "is_ignore": "false",
        "is_row_identifier": "false",
        "is_target": "false",
        "name": "Reco_Insurance_Type",
        "nominal_value": [
          "Individual",
          "Joint"
        ],
        "number_of_missing_values": "0"
      },
      {
        "data_type": "nominal",
        "index": "6",
        "is_ignore": "false",
        "is_row_identifier": "false",
        "is_target": "false",
        "name": "Is_Spouse",
        "nominal_value": [
          "No",
          "Yes"
        ],
        "number_of_missing_values": "0"
      },
      {
        "data_type": "nominal",
        "index": "7",
        "is_ignore": "false",
        "is_row_identifier": "false",
        "is_target": "false",
        "name": "Health Indicator",
        "nominal_value": [
          "X1",
          "X2",
          "X3",
          "X4",
          "X5",
          "X6",
          "X7",
          "X8",
          "X9"
        ],
        "number_of_missing_values": "0"
      },
      {
        "data_type": "nominal",
        "index": "8",
        "is_ignore": "false",
        "is_row_identifier": "false",
        "is_target": "false",
        "name": "Holding_Policy_Duration",
        "nominal_value": [
          "1.0",
          "10.0",
          "11.0",
          "12.0",
          "13.0",
          "14+",
          "14.0",
          "2.0",
          "3.0",
          "4.0",
          "5.0",
          "6.0",
          "7.0",
          "8.0",
          "9.0"
        ],
        "number_of_missing_values": "0"
      },
      {
        "data_type": "nominal",
        "index": "9",
        "is_ignore": "false",
        "is_row_identifier": "false",
        "is_target": "false",
        "name": "Holding_Policy_Type",
        "nominal_value": [
          "1.0",
          "2.0",
          "3.0",
          "4.0"
        ],
        "number_of_missing_values": "0"
      },
      {
        "data_type": "numeric",
        "index": "10",
        "is_ignore": "false",
        "is_row_identifier": "false",
        "is_target": "true",
        "name": "class",
        "number_of_missing_values": "0"
      }
    ]
  }
}