{
  "data_qualities": {
    "quality": [
      {
        "name": "AutoCorrelation",
        "value": "0.9999910523348932"
      },
      {
        "name": "Dimensionality",
        "value": "2.952703065442637E-4"
      },
      {
        "name": "MajorityClassPercentage",
        "value": "50.0"
      },
      {
        "name": "MajorityClassSize",
        "value": "55881.0"
      },
      {
        "name": "MinorityClassPercentage",
        "value": "50.0"
      },
      {
        "name": "MinorityClassSize",
        "value": "55881.0"
      },
      {
        "name": "NumberOfBinaryFeatures",
        "value": "4.0"
      },
      {
        "name": "NumberOfClasses",
        "value": "2.0"
      },
      {
        "name": "NumberOfFeatures",
        "value": "33.0"
      },
      {
        "name": "NumberOfInstances",
        "value": "111762.0"
      },
      {
        "name": "NumberOfInstancesWithMissingValues",
        "value": "0.0"
      },
      {
        "name": "NumberOfMissingValues",
        "value": "0.0"
      },
      {
        "name": "NumberOfNumericFeatures",
        "value": "29.0"
      },
      {
        "name": "NumberOfSymbolicFeatures",
        "value": "4.0"
      },
      {
        "name": "PercentageOfBinaryFeatures",
        "value": "12.121212121212121"
      },
      {
        "name": "PercentageOfInstancesWithMissingValues",
        "value": "0.0"
      },
      {
        "name": "PercentageOfMissingValues",
        "value": "0.0"
      },
      {
        "name": "PercentageOfNumericFeatures",
        "value": "87.87878787878788"
      },
      {
        "name": "PercentageOfSymbolicFeatures",
        "value": "12.121212121212121"
      }
    ]
  }
}