{
  "data_set_description": {
    "contributor": "Leo Grin",
    "default_target_attribute": "target",
    "description": "Dataset used in the tabular data benchmark https://github.com/LeoGrin/tabular-benchmark, transformed in the same way. This dataset belongs to the \"classification on numerical features\" benchmark. \n \n  Original link: https://openml.org/d/4134 \n \n Original description: \n \n**Author**: Boehringer Ingelheim  \n**Source**: [Kaggle](https://www.kaggle.com/c/bioresponse) - 2011  \n**Please cite**: None  \n\nPredict a biological response of molecules from their chemical properties. Each row in this data set represents a molecule. The first column contains experimental data describing an actual biological response; the molecule was seen to elicit this response (1), or not (0). The remaining columns represent molecular descriptors (d1 through d1776), these are calculated properties that can capture some of the characteristics of the molecule - for example size, shape, or elemental constitution. The descriptor matrix has been normalized.\n\nThe original training and test set were merged.",
    "description_version": "1",
    "file_id": "22111905",
    "format": "arff",
    "id": "45019",
    "licence": "Public",
    "md5_checksum": "58f4633d9617bcbe7d3b27f6ccfdca00",
    "minio_url": "https://data.openml.org/datasets/0004/45019/dataset_45019.pq",
    "name": "Bioresponse",
    "parquet_url": "https://data.openml.org/datasets/0004/45019/dataset_45019.pq",
    "processing_date": "2023-01-03 15:29:18",
    "status": "active",
    "upload_date": "2023-01-03T15:28:10",
    "url": "https://api.openml.org/data/v1/download/22111905/Bioresponse.arff",
    "version": "3",
    "visibility": "public"
  }
}