{
  "data_set_description": {
    "citation": "Dua, D. and Graff, C. (2019). UCI Machine Learning Repository [http://archive.ics.uci.edu/ml]. Irvine, CA: University of California, School of Information and Computer Science.",
    "default_target_attribute": "energy_total",
    "description": "**Data Description**\n\nThis data set consists of positions and absorbed power outputs of wave energy converters (WECs) in four real wave scenarios from the southern coast of Australia.\n\nThe data is obtained from an optimization method (blackbox optimization) with the goal of finding the optimal buoys placement.\n\nEach instance represents wave energy returns for different placements of 16 buoys.\n\n**Attribute Description**\n\n1. *x[1-16]* - WECs positions (0-566)\n2. *y[1-16]* - WECs positions (0-566)\n3. *energy[1-16]* - WECs absorbed power (should be ignored if *energy_total* is considered as the target variable)\n4. *energy_total* - total power output of the farm: Powerall, target feature",
    "description_version": "1",
    "file_id": "22111839",
    "format": "arff",
    "id": "44975",
    "licence": "CC BY 4.0",
    "md5_checksum": "762a4638b1019db2db361d1c018e3e92",
    "minio_url": "https://data.openml.org/datasets/0004/44975/dataset_44975.pq",
    "name": "wave_energy",
    "original_data_url": "https://archive.ics.uci.edu/ml/datasets/Wave+Energy+Converters",
    "parquet_url": "https://data.openml.org/datasets/0004/44975/dataset_44975.pq",
    "processing_date": "2022-12-22 16:15:11",
    "status": "active",
    "upload_date": "2022-12-22T16:14:43",
    "url": "https://api.openml.org/data/v1/download/22111839/wave_energy.arff",
    "version": "6",
    "visibility": "public"
  }
}