{
  "data_set_description": {
    "citation": "Dua, D. and Graff, C. (2019). UCI Machine Learning Repository [http://archive.ics.uci.edu/ml]. Irvine, CA: University of California, School of Information and Computer Science.",
    "default_target_attribute": "quality",
    "description": "**Data Description**\n\nThe data were collected from May/2004 to February/2007 using only protected designation of origin samples that were tested at the official certification entity (CVRVV). The CVRVV is an inter-professional organization with the goal of improving the quality and marketing of vinho verde. The data were recorded by a computerized system (iLab), which automatically manages the process of wine sample testing from producer requests to laboratory and sensory analysis. Each entry denotes a given test (analytical or sensory).\n\nThe goal is using chemical analysis determine the quality of the wine.\n\nThis version of the dataset contains only the white wine.\n\n**Attribute Description**\n\n1. *fixed_acidity*\n2. *volatile_acidity*\n3. *citric_acid*\n4. *residual_sugar*\n5. *chlorides*\n6. *free_sulfur_dioxide*\n7. *total_sulfur_dioxide*\n8. *density*\n9. *pH*\n10. *sulphates*\n11. *alcohol*\n12. *quality* - target feature",
    "description_version": "1",
    "file_id": "22111835",
    "format": "arff",
    "id": "44971",
    "licence": "CC BY 4.0",
    "md5_checksum": "06231dd5ef55e3a9d5038f4f3ad88598",
    "minio_url": "https://data.openml.org/datasets/0004/44971/dataset_44971.pq",
    "name": "white_wine",
    "original_data_url": "https://archive.ics.uci.edu/ml/datasets/wine",
    "paper_url": "https://doi.org/10.1016/j.dss.2009.05.016",
    "parquet_url": "https://data.openml.org/datasets/0004/44971/dataset_44971.pq",
    "processing_date": "2022-12-22 16:13:30",
    "status": "active",
    "upload_date": "2022-12-22T16:13:13",
    "url": "https://api.openml.org/data/v1/download/22111835/white_wine.arff",
    "version": "7",
    "visibility": "public"
  }
}