{
  "data_set_description": {
    "citation": "Dua, D. and Graff, C. (2019). UCI Machine Learning Repository [http://archive.ics.uci.edu/ml]. Irvine, CA: University of California, School of Information and Computer Science. \nA. Tsanas, A. Xifara: 'Accurate quantitative estimation of energy performance of residential buildings using statistical machine learning tools', Energy and Buildings, Vol. 49, pp. 560-567, 2012",
    "default_target_attribute": "heating_load",
    "description": "**Data Description**\n\nThis dataset looked into assessing the heating load and cooling load requirements of buildings (that is, energy efficiency) as a function of building parameters.\nEnergy analysis is performed using 12 different building shapes simulated in Ecotect. The buildings differ with respect to the glazing area, the glazing area distribution, and the orientation, amongst other parameters. Various settings as functions of the afore-mentioned characteristics are simulated to obtain 768 building shapes (number of observations in the dataset).\n\n**Attribute Description**\n\nAll features describe different properties for the building.\n\n1. *relative_compactness*\n2. *surface_area*\n3. *wall_area*\n4. *roof_area*\n5. *overall_height*\n6. *orientation*\n7. *glazing_area*\n8. *glazing_area_distribution*\n9. *heating_load* - one possible option for target feature\n10. *cooling_load* - one possible option for target feature",
    "description_version": "1",
    "file_id": "22111824",
    "format": "arff",
    "id": "44960",
    "ignore_attribute": "cooling_load",
    "licence": "CC BY 4.0",
    "md5_checksum": "9e361531fc8e672174ddb393144a60c9",
    "minio_url": "https://data.openml.org/datasets/0004/44960/dataset_44960.pq",
    "name": "energy_efficiency",
    "original_data_url": "https://archive.ics.uci.edu/ml/datasets/energy+efficiency",
    "paper_url": "https://doi.org/10.1016/j.enbuild.2012.03.003",
    "parquet_url": "https://data.openml.org/datasets/0004/44960/dataset_44960.pq",
    "processing_date": "2022-12-22 16:11:22",
    "status": "active",
    "upload_date": "2022-12-22T16:11:13",
    "url": "https://api.openml.org/data/v1/download/22111824/energy_efficiency.arff",
    "version": "9",
    "visibility": "public"
  }
}