{
  "data_set_description": {
    "default_target_attribute": "MEDIAN_PXC50",
    "description": "**Data Description**\n\nThis dataset contains drugs and their potency.\nThe features of the drug are FCFP 1024bit Molecular Fingerprints which were generated from SMILES strings. They were obtained using the Pipeline Pilot program, Dassault Systemes BIOVIA.\n\n**Attribute Description**\n\n1. *MEDIAN_PXC50* - target feature\n2. *MOLECULE_CHEMBL_ID* - id\n3. *FCFP.* - molecular fingerprints",
    "description_version": "1",
    "file_id": "22111818",
    "format": "arff",
    "id": "44954",
    "licence": "Public",
    "md5_checksum": "330f994e67d417fce0bb5e6d7d695ade",
    "minio_url": "http://openml1.win.tue.nl/dataset44954/dataset_44954.pq",
    "name": "QSAR_TID_11",
    "original_data_url": "https://www.openml.org/search?type=data&sort=runs&id=3050&status=active",
    "parquet_url": "http://openml1.win.tue.nl/dataset44954/dataset_44954.pq",
    "processing_date": "2022-12-22 16:11:06",
    "status": "active",
    "upload_date": "2022-12-22T16:10:25",
    "url": "https://api.openml.org/data/v1/download/22111818/QSAR_TID_11.arff",
    "version": "2",
    "visibility": "public"
  }
}