{
  "data_qualities": {
    "quality": [
      {
        "name": "AutoCorrelation",
        "value": "0.46296296296296297"
      },
      {
        "name": "CfsSubsetEval_DecisionStumpAUC",
        "value": "0.4955081569664903"
      },
      {
        "name": "CfsSubsetEval_DecisionStumpErrRate",
        "value": "0.3765432098765432"
      },
      {
        "name": "CfsSubsetEval_DecisionStumpKappa",
        "value": "0.0"
      },
      {
        "name": "CfsSubsetEval_NaiveBayesAUC",
        "value": "0.4955081569664903"
      },
      {
        "name": "CfsSubsetEval_NaiveBayesErrRate",
        "value": "0.3765432098765432"
      },
      {
        "name": "CfsSubsetEval_NaiveBayesKappa",
        "value": "0.0"
      },
      {
        "name": "CfsSubsetEval_kNN1NAUC",
        "value": "0.4955081569664903"
      },
      {
        "name": "CfsSubsetEval_kNN1NErrRate",
        "value": "0.3765432098765432"
      },
      {
        "name": "CfsSubsetEval_kNN1NKappa",
        "value": "0.0"
      },
      {
        "name": "ClassEntropy",
        "value": "1.2390282933621277"
      },
      {
        "name": "DecisionStumpAUC",
        "value": "0.5429993741821698"
      },
      {
        "name": "DecisionStumpErrRate",
        "value": "0.3765432098765432"
      },
      {
        "name": "DecisionStumpKappa",
        "value": "0.0"
      },
      {
        "name": "Dimensionality",
        "value": "0.1656441717791411"
      },
      {
        "name": "EquivalentNumberOfAtts",
        "value": "33.87897705530106"
      },
      {
        "name": "J48.00001.AUC",
        "value": "0.463511774898521"
      },
      {
        "name": "J48.00001.ErrRate",
        "value": "0.4444444444444444"
      },
      {
        "name": "J48.00001.Kappa",
        "value": "-0.03385924481474897"
      },
      {
        "name": "J48.0001.AUC",
        "value": "0.463511774898521"
      },
      {
        "name": "J48.0001.ErrRate",
        "value": "0.4444444444444444"
      },
      {
        "name": "J48.0001.Kappa",
        "value": "-0.03385924481474897"
      },
      {
        "name": "J48.001.AUC",
        "value": "0.463511774898521"
      },
      {
        "name": "J48.001.ErrRate",
        "value": "0.4444444444444444"
      },
      {
        "name": "J48.001.Kappa",
        "value": "-0.03385924481474897"
      },
      {
        "name": "MajorityClassPercentage",
        "value": "61.963190184049076"
      },
      {
        "name": "MajorityClassSize",
        "value": "101.0"
      },
      {
        "name": "MaxAttributeEntropy",
        "value": "2.7101014215918826"
      },
      {
        "name": "MaxKurtosisOfNumericAtts",
        "value": "1.0755732758130443"
      },
      {
        "name": "MaxMeansOfNumericAtts",
        "value": "92.82822085889566"
      },
      {
        "name": "MaxMutualInformation",
        "value": "0.08976467226642"
      },
      {
        "name": "MaxNominalAttDistinctValues",
        "value": "7.0"
      },
      {
        "name": "MaxSkewnessOfNumericAtts",
        "value": "1.0554371885088176"
      },
      {
        "name": "MaxStdDevOfNumericAtts",
        "value": "52.647874431145844"
      },
      {
        "name": "MeanAttributeEntropy",
        "value": "1.2248467722562069"
      },
      {
        "name": "MeanKurtosisOfNumericAtts",
        "value": "-0.49788080338502716"
      },
      {
        "name": "MeanMeansOfNumericAtts",
        "value": "29.4534449241334"
      },
      {
        "name": "MeanMutualInformation",
        "value": "0.03657218726939857"
      },
      {
        "name": "MeanNoiseToSignalRatio",
        "value": "32.49120913205773"
      },
      {
        "name": "MeanNominalAttDistinctValues",
        "value": "3.466666666666667"
      },
      {
        "name": "MeanSkewnessOfNumericAtts",
        "value": "0.3627001024738282"
      },
      {
        "name": "MeanStdDevOfNumericAtts",
        "value": "16.921501965086275"
      },
      {
        "name": "MinAttributeEntropy",
        "value": "0.16622269478192106"
      },
      {
        "name": "MinKurtosisOfNumericAtts",
        "value": "-1.3227963086268422"
      },
      {
        "name": "MinMeansOfNumericAtts",
        "value": "4.617283950617283"
      },
      {
        "name": "MinMutualInformation",
        "value": "0.00561552213062"
      },
      {
        "name": "MinNominalAttDistinctValues",
        "value": "2.0"
      },
      {
        "name": "MinSkewnessOfNumericAtts",
        "value": "-0.05316626326280493"
      },
      {
        "name": "MinStdDevOfNumericAtts",
        "value": "2.944254730161723"
      },
      {
        "name": "MinorityClassPercentage",
        "value": "0.6134969325153374"
      },
      {
        "name": "MinorityClassSize",
        "value": "1.0"
      },
      {
        "name": "NaiveBayesAUC",
        "value": "0.5870825046812658"
      },
      {
        "name": "NaiveBayesErrRate",
        "value": "0.4876543209876543"
      },
      {
        "name": "NaiveBayesKappa",
        "value": "0.040629685157421366"
      },
      {
        "name": "NumberOfBinaryFeatures",
        "value": "8.0"
      },
      {
        "name": "NumberOfClasses",
        "value": "5.0"
      },
      {
        "name": "NumberOfFeatures",
        "value": "27.0"
      },
      {
        "name": "NumberOfInstances",
        "value": "163.0"
      },
      {
        "name": "NumberOfInstancesWithMissingValues",
        "value": "1.0"
      },
      {
        "name": "NumberOfMissingValues",
        "value": "9.0"
      },
      {
        "name": "NumberOfNumericFeatures",
        "value": "12.0"
      },
      {
        "name": "NumberOfSymbolicFeatures",
        "value": "15.0"
      },
      {
        "name": "PercentageOfBinaryFeatures",
        "value": "29.629629629629626"
      },
      {
        "name": "PercentageOfInstancesWithMissingValues",
        "value": "0.6134969325153374"
      },
      {
        "name": "PercentageOfMissingValues",
        "value": "0.2044989775051125"
      },
      {
        "name": "PercentageOfNumericFeatures",
        "value": "44.44444444444444"
      },
      {
        "name": "PercentageOfSymbolicFeatures",
        "value": "55.55555555555556"
      },
      {
        "name": "Quartile1AttributeEntropy",
        "value": "0.821141702262164"
      },
      {
        "name": "Quartile1KurtosisOfNumericAtts",
        "value": "-1.208999788969232"
      },
      {
        "name": "Quartile1MeansOfNumericAtts",
        "value": "4.877196470499129"
      },
      {
        "name": "Quartile1MutualInformation",
        "value": "0.0141595490124875"
      },
      {
        "name": "Quartile1SkewnessOfNumericAtts",
        "value": "-0.03808443270504655"
      },
      {
        "name": "Quartile1StdDevOfNumericAtts",
        "value": "3.1503515618209827"
      },
      {
        "name": "Quartile2AttributeEntropy",
        "value": "0.9999728498609091"
      },
      {
        "name": "Quartile2KurtosisOfNumericAtts",
        "value": "-0.7977535714962081"
      },
      {
        "name": "Quartile2MeansOfNumericAtts",
        "value": "10.240437779292584"
      },
      {
        "name": "Quartile2MutualInformation",
        "value": "0.022926451119585002"
      },
      {
        "name": "Quartile2SkewnessOfNumericAtts",
        "value": "0.30927723619348374"
      },
      {
        "name": "Quartile2StdDevOfNumericAtts",
        "value": "5.962592155249089"
      },
      {
        "name": "Quartile3AttributeEntropy",
        "value": "1.5697674469792249"
      },
      {
        "name": "Quartile3KurtosisOfNumericAtts",
        "value": "0.19012671027325556"
      },
      {
        "name": "Quartile3MeansOfNumericAtts",
        "value": "72.99235969097928"
      },
      {
        "name": "Quartile3MutualInformation",
        "value": "0.0660381393431625"
      },
      {
        "name": "Quartile3SkewnessOfNumericAtts",
        "value": "0.7289621406586595"
      },
      {
        "name": "Quartile3StdDevOfNumericAtts",
        "value": "41.63591978331559"
      },
      {
        "name": "REPTreeDepth1AUC",
        "value": "0.479636911255074"
      },
      {
        "name": "REPTreeDepth1ErrRate",
        "value": "0.43209876543209874"
      },
      {
        "name": "REPTreeDepth1Kappa",
        "value": "-0.03259879803314512"
      },
      {
        "name": "REPTreeDepth2AUC",
        "value": "0.479636911255074"
      },
      {
        "name": "REPTreeDepth2ErrRate",
        "value": "0.43209876543209874"
      },
      {
        "name": "REPTreeDepth2Kappa",
        "value": "-0.03259879803314512"
      },
      {
        "name": "REPTreeDepth3AUC",
        "value": "0.479636911255074"
      },
      {
        "name": "REPTreeDepth3ErrRate",
        "value": "0.43209876543209874"
      },
      {
        "name": "REPTreeDepth3Kappa",
        "value": "-0.03259879803314512"
      },
      {
        "name": "RandomTreeDepth1AUC",
        "value": "0.5746014662812816"
      },
      {
        "name": "RandomTreeDepth1ErrRate",
        "value": "0.4506172839506173"
      },
      {
        "name": "RandomTreeDepth1Kappa",
        "value": "0.12864721485411143"
      },
      {
        "name": "RandomTreeDepth2AUC",
        "value": "0.5746014662812816"
      },
      {
        "name": "RandomTreeDepth2ErrRate",
        "value": "0.4506172839506173"
      },
      {
        "name": "RandomTreeDepth2Kappa",
        "value": "0.12864721485411143"
      },
      {
        "name": "RandomTreeDepth3AUC",
        "value": "0.5746014662812816"
      },
      {
        "name": "RandomTreeDepth3ErrRate",
        "value": "0.4506172839506173"
      },
      {
        "name": "RandomTreeDepth3Kappa",
        "value": "0.12864721485411143"
      },
      {
        "name": "StdvNominalAttDistinctValues",
        "value": "1.9952324127660872"
      },
      {
        "name": "kNN1NAUC",
        "value": "0.43441027182261405"
      },
      {
        "name": "kNN1NErrRate",
        "value": "0.5740740740740741"
      },
      {
        "name": "kNN1NKappa",
        "value": "-0.12131586781780293"
      }
    ]
  }
}