{
  "data_set_description": {
    "citation": "Dua, D. and Graff, C. (2019). UCI Machine Learning Repository [http://archive.ics.uci.edu/ml]. Irvine, CA: University of California, School of Information and Computer Science. \n[Cortez and Morais, 2007] P. Cortez and A. Morais. A Data Mining Approach to Predict Forest Fires using Meteorological Data. In J. Neves, M. F. Santos and J. Machado Eds., New Trends in Artificial Intelligence, Proceedings of the 13th EPIA 2007 - Portuguese Conference on Artificial Intelligence, December, Guimaraes, Portugal, pp. 512-523, 2007. APPIA, ISBN-13 978-989-95618-0-9.",
    "default_target_attribute": "area",
    "description": "**Data Description**\n\nThe aim of this dataset is to predict the burned area of forest fires, in the northeast region of Portugal, by using meteorological and other data.\n\nThe output 'area' was first transformed with a $ln(x+1)$ function. Then, several Data Mining methods were applied. After fitting the models, the outputs were  post-processed with the inverse of the $ln(x+1)$ transform. Four different input setups were used.\n\n**Attribute Description**\n\n1. *X* - x-axis spatial coordinate within the Montesinho park map: 1 to 9\n2. *Y* - y-axis spatial coordinate within the Montesinho park map: 2 to 9\n3. *month* - month of the year: 'jan' to 'dec'\n4. *day* - day of the week: 'mon' to 'sun'\n5. *FFMC* - FFMC index from the FWI system: 18.7 to 96.20\n6. *DMC* - DMC index from the FWI system: 1.1 to 291.3\n7. *DC* - DC index from the FWI system: 7.9 to 860.6\n8. *ISI* - ISI index from the FWI system: 0.0 to 56.10\n9. *temp* - temperature in Celsius degrees: 2.2 to 33.30\n10. *RH* - relative humidity in %: 15.0 to 100\n11. *wind* - wind speed in km/h: 0.40 to 9.40\n12. *rain* - outside rain in mm/m2 : 0.0 to 6.4\n13. *area* - the burned area of the forest (in ha): 0.00 to 1090.84 (this target variable is very skewed towards 0.0, thus it may make sense to model with the logarithm transform).",
    "description_version": "1",
    "file_id": "22111702",
    "format": "arff",
    "id": "44838",
    "licence": "CC BY 4.0",
    "md5_checksum": "0de257b0ce71eb197e1c774a4071705b",
    "minio_url": "http://openml1.win.tue.nl/dataset44838/dataset_44838.pq",
    "name": "forest_fires",
    "original_data_url": "https://archive.ics.uci.edu/ml/datasets/forest+fires",
    "paper_url": "https://www.semanticscholar.org/paper/A-data-mining-approach-to-predict-forest-fires-data-Cortez-Morais/0f529dc2b2b2bad22394454d4cba79e2c319f0b0",
    "parquet_url": "http://openml1.win.tue.nl/dataset44838/dataset_44838.pq",
    "processing_date": "2022-12-22 14:28:03",
    "status": "active",
    "upload_date": "2022-12-22T14:28:02",
    "url": "https://api.openml.org/data/v1/download/22111702/forest_fires.arff",
    "version": "2",
    "visibility": "public"
  }
}