{
  "data_features": {
    "feature": [
      {
        "data_type": "nominal",
        "index": "0",
        "is_ignore": "false",
        "is_row_identifier": "false",
        "is_target": "false",
        "name": "fathers_occupation",
        "nominal_value": [
          "Clerk",
          "Craftsman-Construction",
          "Craftsman-Manufacturing",
          "Craftsmen-Other",
          "Farm_Laborer",
          "Farmer/Farm_Manager",
          "Laborer-Manufacturing",
          "Laborer-Nonmanufacturing",
          "Manager",
          "Operative-Manufacturing",
          "Operative-Nonmanufacturing",
          "Professional-Salaried",
          "Professional_Self-Employed",
          "Proprietor",
          "Salesman-Nonretail",
          "Salesman-Retail",
          "Service_Worker"
        ],
        "number_of_missing_values": "0"
      },
      {
        "data_type": "nominal",
        "index": "1",
        "is_ignore": "false",
        "is_row_identifier": "false",
        "is_target": "false",
        "name": "sons_occupation",
        "nominal_value": [
          "Clerk",
          "Craftsman-Construction",
          "Craftsman-Manufacturing",
          "Craftsmen-Other",
          "Farm_Laborer",
          "Farmer/Farm_Manager",
          "Laborer-Manufacturing",
          "Laborer-Nonmanufacturing",
          "Manager",
          "Operative-Manufacturing",
          "Operative-Nonmanufacturing",
          "Professional-Salaried",
          "Professional_Self-Employed",
          "Proprietor",
          "Salesman-Nonretail",
          "Salesman-Retail",
          "Service_Worker"
        ],
        "number_of_missing_values": "0"
      },
      {
        "data_type": "nominal",
        "index": "2",
        "is_ignore": "false",
        "is_row_identifier": "false",
        "is_target": "false",
        "name": "family_structure",
        "nominal_value": [
          "intact",
          "nonintact"
        ],
        "number_of_missing_values": "0"
      },
      {
        "data_type": "nominal",
        "index": "3",
        "is_ignore": "false",
        "is_row_identifier": "false",
        "is_target": "false",
        "name": "race",
        "nominal_value": [
          "black",
          "white"
        ],
        "number_of_missing_values": "0"
      },
      {
        "data_type": "numeric",
        "index": "4",
        "is_ignore": "false",
        "is_row_identifier": "false",
        "is_target": "false",
        "name": "counts_for_sons_first_occupation",
        "number_of_missing_values": "0"
      },
      {
        "data_type": "numeric",
        "index": "5",
        "is_ignore": "false",
        "is_row_identifier": "false",
        "is_target": "true",
        "name": "counts_for_sons_current_occupation",
        "number_of_missing_values": "0"
      }
    ]
  }
}