{
  "data_set_description": {
    "citation": "Dua, D. and Graff, C. (2019). UCI Machine Learning Repository [http://archive.ics.uci.edu/ml]. Irvine, CA: University of California, School of Information and Computer Science.",
    "default_target_attribute": "stab",
    "description": "**Data Description**\n\nThe local stability analysis of the 4-node star system (electricity producer is in the center) implementing Decentral Smart Grid Control concept was performed.\n\nThis dataset contains simulations regarding electrical grid stability. The model is composed of a generator model and an economic model.\n\nThe analysis is performed for different sets of input values. Several input values are kept the same: averaging time - 2s, coupling strength - 8s^-2, damping - 0.1s^-1.\n\nThe goal is to estimate the stability of the system.\n\n**Attribute Description**\n\n14 features describing the system:\n\n1. *tau[1-4]* - reaction time of participant (real from the range [0.5,10]s), tau1 - value for electricity producer\n2. *p[1-4]* - nominal power consumed(negative) / produced(positive)(real). For consumers from the range [-0.5,-2]s^-2; p1 = abs(p2 + p3 + p4)\n3. *g[1-4]* - coefficient (gamma) proportional to price elasticity (real from the range [0.05,1]s^-1), g1 - the value for electricity producer\n4. *stab* - the maximal real part of the characteristic equation root (if positive - the system is linearly unstable), target feature\n5. *stabf* - the stability label of the system (categorical: stable/unstable), alternate target feature for a classification task",
    "description_version": "1",
    "file_id": "22111682",
    "format": "arff",
    "id": "44818",
    "ignore_attribute": "stabf",
    "licence": "CC BY 4.0",
    "md5_checksum": "56cc21ebd3fe4ee7b45cfbbbcd786dbc",
    "minio_url": "http://openml1.win.tue.nl/dataset44818/dataset_44818.pq",
    "name": "grid_stability",
    "original_data_url": "https://archive.ics.uci.edu/ml/datasets/Electrical+Grid+Stability+Simulated+Data+",
    "paper_url": "https://doi.org/10.1109/SmartGridComm.2018.8587498",
    "parquet_url": "http://openml1.win.tue.nl/dataset44818/dataset_44818.pq",
    "processing_date": "2022-12-22 11:19:03",
    "status": "active",
    "upload_date": "2022-12-22T11:18:42",
    "url": "https://api.openml.org/data/v1/download/22111682/grid_stability.arff",
    "version": "1",
    "visibility": "public"
  }
}