{
  "data_qualities": {
    "quality": [
      {
        "name": "AutoCorrelation",
        "value": "0.41870935467733866"
      },
      {
        "name": "Dimensionality",
        "value": "0.021"
      },
      {
        "name": "MajorityClassPercentage",
        "value": "57.35"
      },
      {
        "name": "MajorityClassSize",
        "value": "1147.0"
      },
      {
        "name": "MinorityClassPercentage",
        "value": "0.05"
      },
      {
        "name": "MinorityClassSize",
        "value": "1.0"
      },
      {
        "name": "NumberOfBinaryFeatures",
        "value": "5.0"
      },
      {
        "name": "NumberOfClasses",
        "value": "8.0"
      },
      {
        "name": "NumberOfFeatures",
        "value": "42.0"
      },
      {
        "name": "NumberOfInstances",
        "value": "2000.0"
      },
      {
        "name": "NumberOfInstancesWithMissingValues",
        "value": "0.0"
      },
      {
        "name": "NumberOfMissingValues",
        "value": "0.0"
      },
      {
        "name": "NumberOfNumericFeatures",
        "value": "32.0"
      },
      {
        "name": "NumberOfSymbolicFeatures",
        "value": "10.0"
      },
      {
        "name": "PercentageOfBinaryFeatures",
        "value": "11.904761904761903"
      },
      {
        "name": "PercentageOfInstancesWithMissingValues",
        "value": "0.0"
      },
      {
        "name": "PercentageOfMissingValues",
        "value": "0.0"
      },
      {
        "name": "PercentageOfNumericFeatures",
        "value": "76.19047619047619"
      },
      {
        "name": "PercentageOfSymbolicFeatures",
        "value": "23.809523809523807"
      }
    ]
  }
}