{
  "data_qualities": {
    "quality": [
      {
        "name": "AutoCorrelation",
        "value": "0.15507753876938468"
      },
      {
        "name": "Dimensionality",
        "value": "0.0505"
      },
      {
        "name": "MajorityClassPercentage",
        "value": "21.95"
      },
      {
        "name": "MajorityClassSize",
        "value": "439.0"
      },
      {
        "name": "MinorityClassPercentage",
        "value": "2.35"
      },
      {
        "name": "MinorityClassSize",
        "value": "47.0"
      },
      {
        "name": "NumberOfBinaryFeatures",
        "value": "0.0"
      },
      {
        "name": "NumberOfClasses",
        "value": "10.0"
      },
      {
        "name": "NumberOfFeatures",
        "value": "101.0"
      },
      {
        "name": "NumberOfInstances",
        "value": "2000.0"
      },
      {
        "name": "NumberOfInstancesWithMissingValues",
        "value": "0.0"
      },
      {
        "name": "NumberOfMissingValues",
        "value": "0.0"
      },
      {
        "name": "NumberOfNumericFeatures",
        "value": "100.0"
      },
      {
        "name": "NumberOfSymbolicFeatures",
        "value": "1.0"
      },
      {
        "name": "PercentageOfBinaryFeatures",
        "value": "0.0"
      },
      {
        "name": "PercentageOfInstancesWithMissingValues",
        "value": "0.0"
      },
      {
        "name": "PercentageOfMissingValues",
        "value": "0.0"
      },
      {
        "name": "PercentageOfNumericFeatures",
        "value": "99.00990099009901"
      },
      {
        "name": "PercentageOfSymbolicFeatures",
        "value": "0.9900990099009901"
      }
    ]
  }
}