{
  "data_qualities": {
    "quality": [
      {
        "name": "AutoCorrelation",
        "value": "0.41670835417708857"
      },
      {
        "name": "Dimensionality",
        "value": "0.0035"
      },
      {
        "name": "MajorityClassPercentage",
        "value": "51.449999999999996"
      },
      {
        "name": "MajorityClassSize",
        "value": "1029.0"
      },
      {
        "name": "MinorityClassPercentage",
        "value": "9.700000000000001"
      },
      {
        "name": "MinorityClassSize",
        "value": "194.0"
      },
      {
        "name": "NumberOfBinaryFeatures",
        "value": "0.0"
      },
      {
        "name": "NumberOfClasses",
        "value": "3.0"
      },
      {
        "name": "NumberOfFeatures",
        "value": "7.0"
      },
      {
        "name": "NumberOfInstances",
        "value": "2000.0"
      },
      {
        "name": "NumberOfInstancesWithMissingValues",
        "value": "0.0"
      },
      {
        "name": "NumberOfMissingValues",
        "value": "0.0"
      },
      {
        "name": "NumberOfNumericFeatures",
        "value": "6.0"
      },
      {
        "name": "NumberOfSymbolicFeatures",
        "value": "1.0"
      },
      {
        "name": "PercentageOfBinaryFeatures",
        "value": "0.0"
      },
      {
        "name": "PercentageOfInstancesWithMissingValues",
        "value": "0.0"
      },
      {
        "name": "PercentageOfMissingValues",
        "value": "0.0"
      },
      {
        "name": "PercentageOfNumericFeatures",
        "value": "85.71428571428571"
      },
      {
        "name": "PercentageOfSymbolicFeatures",
        "value": "14.285714285714285"
      }
    ]
  }
}