{
  "data_qualities": {
    "quality": [
      {
        "name": "AutoCorrelation",
        "value": "0.9709854927463731"
      },
      {
        "name": "Dimensionality",
        "value": "0.0185"
      },
      {
        "name": "MajorityClassPercentage",
        "value": "98.55000000000001"
      },
      {
        "name": "MajorityClassSize",
        "value": "1971.0"
      },
      {
        "name": "MinorityClassPercentage",
        "value": "1.4500000000000002"
      },
      {
        "name": "MinorityClassSize",
        "value": "29.0"
      },
      {
        "name": "NumberOfBinaryFeatures",
        "value": "1.0"
      },
      {
        "name": "NumberOfClasses",
        "value": "2.0"
      },
      {
        "name": "NumberOfFeatures",
        "value": "37.0"
      },
      {
        "name": "NumberOfInstances",
        "value": "2000.0"
      },
      {
        "name": "NumberOfInstancesWithMissingValues",
        "value": "0.0"
      },
      {
        "name": "NumberOfMissingValues",
        "value": "0.0"
      },
      {
        "name": "NumberOfNumericFeatures",
        "value": "36.0"
      },
      {
        "name": "NumberOfSymbolicFeatures",
        "value": "1.0"
      },
      {
        "name": "PercentageOfBinaryFeatures",
        "value": "2.7027027027027026"
      },
      {
        "name": "PercentageOfInstancesWithMissingValues",
        "value": "0.0"
      },
      {
        "name": "PercentageOfMissingValues",
        "value": "0.0"
      },
      {
        "name": "PercentageOfNumericFeatures",
        "value": "97.2972972972973"
      },
      {
        "name": "PercentageOfSymbolicFeatures",
        "value": "2.7027027027027026"
      }
    ]
  }
}