{
  "data_qualities": {
    "quality": [
      {
        "name": "AutoCorrelation",
        "value": "0.4332166083041521"
      },
      {
        "name": "Dimensionality",
        "value": "0.025"
      },
      {
        "name": "MajorityClassPercentage",
        "value": "53.900000000000006"
      },
      {
        "name": "MajorityClassSize",
        "value": "1078.0"
      },
      {
        "name": "MinorityClassPercentage",
        "value": "11.15"
      },
      {
        "name": "MinorityClassSize",
        "value": "223.0"
      },
      {
        "name": "NumberOfBinaryFeatures",
        "value": "9.0"
      },
      {
        "name": "NumberOfClasses",
        "value": "3.0"
      },
      {
        "name": "NumberOfFeatures",
        "value": "50.0"
      },
      {
        "name": "NumberOfInstances",
        "value": "2000.0"
      },
      {
        "name": "NumberOfInstancesWithMissingValues",
        "value": "1991.0"
      },
      {
        "name": "NumberOfMissingValues",
        "value": "3850.0"
      },
      {
        "name": "NumberOfNumericFeatures",
        "value": "13.0"
      },
      {
        "name": "NumberOfSymbolicFeatures",
        "value": "37.0"
      },
      {
        "name": "PercentageOfBinaryFeatures",
        "value": "18.0"
      },
      {
        "name": "PercentageOfInstancesWithMissingValues",
        "value": "99.55000000000001"
      },
      {
        "name": "PercentageOfMissingValues",
        "value": "3.85"
      },
      {
        "name": "PercentageOfNumericFeatures",
        "value": "26.0"
      },
      {
        "name": "PercentageOfSymbolicFeatures",
        "value": "74.0"
      }
    ]
  }
}