{
  "data_qualities": {
    "quality": [
      {
        "name": "AutoCorrelation",
        "value": "0.3939393939393939"
      },
      {
        "name": "Dimensionality",
        "value": "1.01"
      },
      {
        "name": "MajorityClassPercentage",
        "value": "56.00000000000001"
      },
      {
        "name": "MajorityClassSize",
        "value": "56.0"
      },
      {
        "name": "MinorityClassPercentage",
        "value": "44.0"
      },
      {
        "name": "MinorityClassSize",
        "value": "44.0"
      },
      {
        "name": "NumberOfBinaryFeatures",
        "value": "1.0"
      },
      {
        "name": "NumberOfClasses",
        "value": "2.0"
      },
      {
        "name": "NumberOfFeatures",
        "value": "101.0"
      },
      {
        "name": "NumberOfInstances",
        "value": "100.0"
      },
      {
        "name": "NumberOfInstancesWithMissingValues",
        "value": "0.0"
      },
      {
        "name": "NumberOfMissingValues",
        "value": "0.0"
      },
      {
        "name": "NumberOfNumericFeatures",
        "value": "100.0"
      },
      {
        "name": "NumberOfSymbolicFeatures",
        "value": "1.0"
      },
      {
        "name": "PercentageOfBinaryFeatures",
        "value": "0.9900990099009901"
      },
      {
        "name": "PercentageOfInstancesWithMissingValues",
        "value": "0.0"
      },
      {
        "name": "PercentageOfMissingValues",
        "value": "0.0"
      },
      {
        "name": "PercentageOfNumericFeatures",
        "value": "99.00990099009901"
      },
      {
        "name": "PercentageOfSymbolicFeatures",
        "value": "0.9900990099009901"
      }
    ]
  }
}