{
  "data_qualities": {
    "quality": [
      {
        "name": "AutoCorrelation",
        "value": "0.5137568784392196"
      },
      {
        "name": "Dimensionality",
        "value": "0.011"
      },
      {
        "name": "MajorityClassPercentage",
        "value": "50.5"
      },
      {
        "name": "MajorityClassSize",
        "value": "1010.0"
      },
      {
        "name": "MinorityClassPercentage",
        "value": "49.5"
      },
      {
        "name": "MinorityClassSize",
        "value": "990.0"
      },
      {
        "name": "NumberOfBinaryFeatures",
        "value": "1.0"
      },
      {
        "name": "NumberOfClasses",
        "value": "2.0"
      },
      {
        "name": "NumberOfFeatures",
        "value": "22.0"
      },
      {
        "name": "NumberOfInstances",
        "value": "2000.0"
      },
      {
        "name": "NumberOfInstancesWithMissingValues",
        "value": "0.0"
      },
      {
        "name": "NumberOfMissingValues",
        "value": "0.0"
      },
      {
        "name": "NumberOfNumericFeatures",
        "value": "21.0"
      },
      {
        "name": "NumberOfSymbolicFeatures",
        "value": "1.0"
      },
      {
        "name": "PercentageOfBinaryFeatures",
        "value": "4.545454545454546"
      },
      {
        "name": "PercentageOfInstancesWithMissingValues",
        "value": "0.0"
      },
      {
        "name": "PercentageOfMissingValues",
        "value": "0.0"
      },
      {
        "name": "PercentageOfNumericFeatures",
        "value": "95.45454545454545"
      },
      {
        "name": "PercentageOfSymbolicFeatures",
        "value": "4.545454545454546"
      }
    ]
  }
}