{
  "data_qualities": {
    "quality": [
      {
        "name": "AutoCorrelation",
        "value": "0.9659829914957478"
      },
      {
        "name": "Dimensionality",
        "value": "0.0465"
      },
      {
        "name": "MajorityClassPercentage",
        "value": "98.2"
      },
      {
        "name": "MajorityClassSize",
        "value": "1964.0"
      },
      {
        "name": "MinorityClassPercentage",
        "value": "1.7999999999999998"
      },
      {
        "name": "MinorityClassSize",
        "value": "36.0"
      },
      {
        "name": "NumberOfBinaryFeatures",
        "value": "3.0"
      },
      {
        "name": "NumberOfClasses",
        "value": "2.0"
      },
      {
        "name": "NumberOfFeatures",
        "value": "93.0"
      },
      {
        "name": "NumberOfInstances",
        "value": "2000.0"
      },
      {
        "name": "NumberOfInstancesWithMissingValues",
        "value": "2000.0"
      },
      {
        "name": "NumberOfMissingValues",
        "value": "125883.0"
      },
      {
        "name": "NumberOfNumericFeatures",
        "value": "73.0"
      },
      {
        "name": "NumberOfSymbolicFeatures",
        "value": "20.0"
      },
      {
        "name": "PercentageOfBinaryFeatures",
        "value": "3.225806451612903"
      },
      {
        "name": "PercentageOfInstancesWithMissingValues",
        "value": "100.0"
      },
      {
        "name": "PercentageOfMissingValues",
        "value": "67.67903225806452"
      },
      {
        "name": "PercentageOfNumericFeatures",
        "value": "78.49462365591397"
      },
      {
        "name": "PercentageOfSymbolicFeatures",
        "value": "21.50537634408602"
      }
    ]
  }
}