{
  "data_qualities": {
    "quality": [
      {
        "name": "AutoCorrelation",
        "value": "0.5102551275637819"
      },
      {
        "name": "Dimensionality",
        "value": "0.009"
      },
      {
        "name": "MajorityClassPercentage",
        "value": "50.0"
      },
      {
        "name": "MajorityClassSize",
        "value": "1000.0"
      },
      {
        "name": "MinorityClassPercentage",
        "value": "50.0"
      },
      {
        "name": "MinorityClassSize",
        "value": "1000.0"
      },
      {
        "name": "NumberOfBinaryFeatures",
        "value": "2.0"
      },
      {
        "name": "NumberOfClasses",
        "value": "2.0"
      },
      {
        "name": "NumberOfFeatures",
        "value": "18.0"
      },
      {
        "name": "NumberOfInstances",
        "value": "2000.0"
      },
      {
        "name": "NumberOfInstancesWithMissingValues",
        "value": "0.0"
      },
      {
        "name": "NumberOfMissingValues",
        "value": "0.0"
      },
      {
        "name": "NumberOfNumericFeatures",
        "value": "8.0"
      },
      {
        "name": "NumberOfSymbolicFeatures",
        "value": "10.0"
      },
      {
        "name": "PercentageOfBinaryFeatures",
        "value": "11.11111111111111"
      },
      {
        "name": "PercentageOfInstancesWithMissingValues",
        "value": "0.0"
      },
      {
        "name": "PercentageOfMissingValues",
        "value": "0.0"
      },
      {
        "name": "PercentageOfNumericFeatures",
        "value": "44.44444444444444"
      },
      {
        "name": "PercentageOfSymbolicFeatures",
        "value": "55.55555555555556"
      }
    ]
  }
}