{
  "data_qualities": {
    "quality": [
      {
        "name": "AutoCorrelation",
        "value": "1.0"
      },
      {
        "name": "Dimensionality",
        "value": "6.115709218412361E-5"
      },
      {
        "name": "MajorityClassPercentage",
        "value": "0.5279895625229339"
      },
      {
        "name": "MajorityClassSize",
        "value": "259.0"
      },
      {
        "name": "MinorityClassPercentage",
        "value": "0.2527826476943776"
      },
      {
        "name": "MinorityClassSize",
        "value": "124.0"
      },
      {
        "name": "NumberOfBinaryFeatures",
        "value": "0.0"
      },
      {
        "name": "NumberOfClasses",
        "value": "315.0"
      },
      {
        "name": "NumberOfFeatures",
        "value": "3.0"
      },
      {
        "name": "NumberOfInstances",
        "value": "49054.0"
      },
      {
        "name": "NumberOfInstancesWithMissingValues",
        "value": "49054.0"
      },
      {
        "name": "NumberOfMissingValues",
        "value": "49054.0"
      },
      {
        "name": "NumberOfNumericFeatures",
        "value": "1.0"
      },
      {
        "name": "NumberOfSymbolicFeatures",
        "value": "0.0"
      },
      {
        "name": "PercentageOfBinaryFeatures",
        "value": "0.0"
      },
      {
        "name": "PercentageOfInstancesWithMissingValues",
        "value": "100.0"
      },
      {
        "name": "PercentageOfMissingValues",
        "value": "33.33333333333333"
      },
      {
        "name": "PercentageOfNumericFeatures",
        "value": "33.33333333333333"
      },
      {
        "name": "PercentageOfSymbolicFeatures",
        "value": "0.0"
      }
    ]
  }
}