{
  "data_qualities": {
    "quality": [
      {
        "name": "AutoCorrelation",
        "value": "1.0"
      },
      {
        "name": "Dimensionality",
        "value": "0.0016666666666666668"
      },
      {
        "name": "MajorityClassPercentage",
        "value": "2.2222222222222223"
      },
      {
        "name": "MajorityClassSize",
        "value": "40.0"
      },
      {
        "name": "MinorityClassPercentage",
        "value": "2.2222222222222223"
      },
      {
        "name": "MinorityClassSize",
        "value": "40.0"
      },
      {
        "name": "NumberOfBinaryFeatures",
        "value": "0.0"
      },
      {
        "name": "NumberOfClasses",
        "value": "45.0"
      },
      {
        "name": "NumberOfFeatures",
        "value": "3.0"
      },
      {
        "name": "NumberOfInstances",
        "value": "1800.0"
      },
      {
        "name": "NumberOfInstancesWithMissingValues",
        "value": "0.0"
      },
      {
        "name": "NumberOfMissingValues",
        "value": "0.0"
      },
      {
        "name": "NumberOfNumericFeatures",
        "value": "0.0"
      },
      {
        "name": "NumberOfSymbolicFeatures",
        "value": "0.0"
      },
      {
        "name": "PercentageOfBinaryFeatures",
        "value": "0.0"
      },
      {
        "name": "PercentageOfInstancesWithMissingValues",
        "value": "0.0"
      },
      {
        "name": "PercentageOfMissingValues",
        "value": "0.0"
      },
      {
        "name": "PercentageOfNumericFeatures",
        "value": "0.0"
      },
      {
        "name": "PercentageOfSymbolicFeatures",
        "value": "0.0"
      }
    ]
  }
}