{
  "data_qualities": {
    "quality": [
      {
        "name": "AutoCorrelation",
        "value": "1.0"
      },
      {
        "name": "Dimensionality",
        "value": "0.007"
      },
      {
        "name": "MajorityClassPercentage",
        "value": "50.0"
      },
      {
        "name": "MajorityClassSize",
        "value": "1000.0"
      },
      {
        "name": "MinorityClassPercentage",
        "value": "50.0"
      },
      {
        "name": "MinorityClassSize",
        "value": "1000.0"
      },
      {
        "name": "NumberOfBinaryFeatures",
        "value": "0.0"
      },
      {
        "name": "NumberOfClasses",
        "value": "2.0"
      },
      {
        "name": "NumberOfFeatures",
        "value": "14.0"
      },
      {
        "name": "NumberOfInstances",
        "value": "2000.0"
      },
      {
        "name": "NumberOfInstancesWithMissingValues",
        "value": "279.0"
      },
      {
        "name": "NumberOfMissingValues",
        "value": "453.0"
      },
      {
        "name": "NumberOfNumericFeatures",
        "value": "9.0"
      },
      {
        "name": "NumberOfSymbolicFeatures",
        "value": "0.0"
      },
      {
        "name": "PercentageOfBinaryFeatures",
        "value": "0.0"
      },
      {
        "name": "PercentageOfInstancesWithMissingValues",
        "value": "13.950000000000001"
      },
      {
        "name": "PercentageOfMissingValues",
        "value": "1.6178571428571427"
      },
      {
        "name": "PercentageOfNumericFeatures",
        "value": "64.28571428571429"
      },
      {
        "name": "PercentageOfSymbolicFeatures",
        "value": "0.0"
      }
    ]
  }
}