{
  "data_set_description": {
    "collection_date": "19-9-2022",
    "creator": "Reading Hydro",
    "default_target_attribute": "downstream",
    "description": "Upstream data from the twin Archimedes screw hydro-electric generator on the river Thames at Caversham weir, Reading, UK.",
    "description_version": "1",
    "file_id": "22106804",
    "format": "arff",
    "id": "44221",
    "language": "English",
    "licence": "Public",
    "md5_checksum": "7972ebba3a3b087b65e9a19be76b0868",
    "minio_url": "https://data.openml.org/datasets/0004/44221/dataset_44221.pq",
    "name": "Reading_Hydro_downstream",
    "parquet_url": "https://data.openml.org/datasets/0004/44221/dataset_44221.pq",
    "processing_date": "2022-09-30 11:39:24",
    "status": "active",
    "upload_date": "2022-09-30T11:39:09",
    "url": "https://api.openml.org/data/v1/download/22106804/Reading_Hydro_downstream.arff",
    "version": "1",
    "visibility": "public"
  }
}