{
  "data_set_description": {
    "creator": "David Wissel, Nikita Janakarajan, Aayush Grover, Enrico Toniato, Maria Rodriguez Martinez, Valentina Boeva",
    "default_target_attribute": "OS,OS_days",
    "description": "Multi-omics bladder cancer dataset containing incomplete modality samples from the TCGA project.",
    "description_version": "1",
    "file_id": "22103369",
    "format": "arff",
    "id": "44188",
    "ignore_attribute": "patient_id",
    "language": "English",
    "licence": "MIT",
    "md5_checksum": "7b9b509c3e4e093f6074c406d1c09605",
    "minio_url": "https://data.openml.org/datasets/0004/44188/dataset_44188.pq",
    "name": "SurvBoard-TCGA-BLCA-incomplete",
    "original_data_url": "https://gdc.cancer.gov/about-data/publications/pancanatlas",
    "parquet_url": "https://data.openml.org/datasets/0004/44188/dataset_44188.pq",
    "processing_date": "2022-08-08 11:29:20",
    "status": "active",
    "upload_date": "2022-08-08T11:29:01",
    "url": "https://api.openml.org/data/v1/download/22103369/SurvBoard-TCGA-BLCA-incomplete.arff",
    "version": "1",
    "version_label": "0.1",
    "visibility": "public"
  }
}