{
  "data_qualities": {
    "quality": [
      {
        "name": "AutoCorrelation",
        "value": "0.2579881656804734"
      },
      {
        "name": "Dimensionality",
        "value": "0.022458628841607566"
      },
      {
        "name": "MajorityClassPercentage",
        "value": "25.768321513002363"
      },
      {
        "name": "MajorityClassSize",
        "value": "218.0"
      },
      {
        "name": "MinorityClassPercentage",
        "value": "23.52245862884161"
      },
      {
        "name": "MinorityClassSize",
        "value": "199.0"
      },
      {
        "name": "NumberOfBinaryFeatures",
        "value": "0.0"
      },
      {
        "name": "NumberOfClasses",
        "value": "4.0"
      },
      {
        "name": "NumberOfFeatures",
        "value": "19.0"
      },
      {
        "name": "NumberOfInstances",
        "value": "846.0"
      },
      {
        "name": "NumberOfInstancesWithMissingValues",
        "value": "0.0"
      },
      {
        "name": "NumberOfMissingValues",
        "value": "0.0"
      },
      {
        "name": "NumberOfNumericFeatures",
        "value": "18.0"
      },
      {
        "name": "NumberOfSymbolicFeatures",
        "value": "1.0"
      },
      {
        "name": "PercentageOfBinaryFeatures",
        "value": "0.0"
      },
      {
        "name": "PercentageOfInstancesWithMissingValues",
        "value": "0.0"
      },
      {
        "name": "PercentageOfMissingValues",
        "value": "0.0"
      },
      {
        "name": "PercentageOfNumericFeatures",
        "value": "94.73684210526315"
      },
      {
        "name": "PercentageOfSymbolicFeatures",
        "value": "5.263157894736842"
      }
    ]
  }
}