{
  "data_set_description": {
    "contributor": "Leo Grin",
    "default_target_attribute": "target",
    "description": "Dataset used in the tabular data benchmark https://github.com/LeoGrin/tabular-benchmark, transformed in the same way. This dataset belongs to the \"classification on numerical features\" benchmark. Original description: \n \nThis is a smaller version of the original dataset, containing 1M rows. \n**Author**: Daniel Whiteson, University of California Irvine  \n**Source**: [UCI](https://archive.ics.uci.edu/ml/datasets/HIGGS)  \n**Please cite**: Baldi, P., P. Sadowski, and D. Whiteson. Searching for Exotic Particles in High-energy Physics with Deep Learning. Nature Communications 5 (July 2, 2014).  \n\n**Higgs Boson detection data**. The data has been produced using Monte Carlo simulations. The first 21 features (columns 2-22) are kinematic properties measured by the particle detectors in the accelerator. The last seven features are functions of the first 21 features; these are high-level features derived by physicists to help discriminate between the two classes. There is an interest in using deep learning methods to obviate the need for physicists to manually develop such features. The last 500,000 examples are used as a test set.\n\n**Note: This is the UCI Higgs dataset, same as version 1, but it fixes the definition of the class attribute, which is categorical, not numeric.**\n\n\n### Attribute Information\n* The first column is the class label (1 for signal, 0 for background)\n* 21 low-level features (kinematic properties): lepton pT, lepton eta, lepton phi, missing energy magnitude, missing energy phi, jet 1 pt, jet 1 eta, jet 1 phi, jet 1 b-tag, jet 2 pt, jet 2 eta, jet 2 phi, jet 2 b-tag, jet 3 pt, jet 3 eta, jet 3 phi, jet 3 b-tag, jet 4 pt, jet 4 eta, jet 4 phi, jet 4 b-tag\n* 7 high-level features derived by physicists: m_jj, m_jjj, m_lv, m_jlv, m_bb, m_wbb, m_wwbb. \n\nFor more detailed information about each feature see the original paper.\n\nRelevant Papers:\n\nBaldi, P., P. Sadowski, and D. Whiteson. Searching for Exotic Particles in High-energy Physics with Deep Learning. Nature Communications 5 (July 2, 2014).",
    "description_version": "1",
    "file_id": "22103254",
    "format": "arff",
    "id": "44129",
    "language": "English",
    "licence": "Public",
    "md5_checksum": "b50862f7a8d8cbed9bdbc39e1825789a",
    "minio_url": "https://data.openml.org/datasets/0004/44129/dataset_44129.pq",
    "name": "Higgs",
    "parquet_url": "https://data.openml.org/datasets/0004/44129/dataset_44129.pq",
    "processing_date": "2022-07-08 23:06:03",
    "status": "active",
    "upload_date": "2022-07-05T20:44:33",
    "url": "https://api.openml.org/data/v1/download/22103254/Higgs.arff",
    "version": "7",
    "visibility": "public"
  }
}