{
  "data_set_description": {
    "citation": "R. Collobert, S. Bengio, and Y. Bengio. A parallel mixture of SVMs for very large scale problems. Neural Computation, 14(05):1105-1114, 2002.",
    "collection_date": "1998-08-01",
    "contributor": "Leo Grin",
    "creator": [
      "Jock A. Blackard",
      "Dr. Denis J. Dean",
      "Dr. Charles W. Anderson"
    ],
    "default_target_attribute": "Y",
    "description": "Dataset used in the tabular data benchmark https://github.com/LeoGrin/tabular-benchmark, transformed in the same way. This dataset belongs to the \"regression on numerical features\" benchmark. Original description: \n \n**Author**: Jock A. Blackard, Dr. Denis J. Dean, Dr. Charles W. Anderson   \n**Source**: [LibSVM repository](http://www.csie.ntu.edu.tw/~cjlin/libsvmtools/datasets/) - 2013-11-14  \n**Please cite**: For the binarization: R. Collobert, S. Bengio, and Y. Bengio. A parallel mixture of SVMs for very large scale problems. Neural Computation, 14(05):1105-1114, 2002.\n\nThis is the famous covertype dataset in its binary version, retrieved 2013-11-13 from the libSVM site (called covtype.binary there). Additional to the preprocessing done there (see LibSVM site for details), this dataset was created as  follows:\n-load covertpype dataset, unscaled.\n-normalize each file columnwise according to the following rules:\n-If a column only contains one value (constant feature), it will set to zero and thus removed by sparsity.\n-If a column contains two values (binary feature), the value occuring more often will be set to zero, the other to one.\n-If a column contains more than two values (multinary/real feature), the column is divided by its std deviation.\n-duplicate lines were finally removed.\n\nPreprocessing: Transform from multiclass into binary class.",
    "description_version": "1",
    "file_id": "22103237",
    "format": "arff",
    "id": "44112",
    "language": "English",
    "licence": "Public",
    "md5_checksum": "bce4a73aeb22238319436a2d189aa276",
    "minio_url": "https://data.openml.org/datasets/0004/44112/dataset_44112.pq",
    "name": "covertype",
    "parquet_url": "https://data.openml.org/datasets/0004/44112/dataset_44112.pq",
    "processing_date": "2022-07-08 23:07:23",
    "status": "active",
    "upload_date": "2022-07-05T17:43:56",
    "url": "https://api.openml.org/data/v1/download/22103237/covertype.arff",
    "version": "11",
    "visibility": "public"
  }
}