{
  "data_set_description": {
    "contributor": "Leo Grin",
    "default_target_attribute": "tip_amount",
    "description": "Dataset used in the tabular data benchmark https://github.com/LeoGrin/tabular-benchmark,  \n                                  transformed in the same way. This dataset belongs to the \"regression on categorical and\n                                  numerical features\" benchmark. Original description: \n \nString datetime information extracted to numeric columns.Trip Record Data provided by the New York City Taxi and Limousine Commission (TLC) [http://www.nyc.gov/html/tlc/html/about/trip_record_data.shtml]. The dataset includes TLC trips of the green line in December 2016. Data was downloaded on 03.11.2018. For a description of all variables in the dataset checkout the TLC homepage [http://www.nyc.gov/html/tlc/downloads/pdf/data_dictionary_trip_records_green.pdf]. The variable 'tip_amount' was chosen as target variable. The variable 'total_amount' is ignored by default, otherwise the target could be predicted deterministically. The date variables 'lpep_pickup_datetime' and 'lpep_dropoff_datetime' (ignored by default) could be used to compute additional time features. In this version, we chose only trips with 'payment_type' == 1 (credit card), as tips are not included for most other payment types. We also removed the variables 'trip_distance' and 'fare_amount' to increase the importance of the categorical features 'PULocationID' and 'DOLocationID'.",
    "description_version": "1",
    "file_id": "22103161",
    "format": "arff",
    "id": "44065",
    "licence": "Public",
    "md5_checksum": "444a85036847e7301d1abd0d7e0ed1f2",
    "minio_url": "https://data.openml.org/datasets/0004/44065/dataset_44065.pq",
    "name": "nyc-taxi-green-dec-2016",
    "parquet_url": "https://data.openml.org/datasets/0004/44065/dataset_44065.pq",
    "processing_date": "2022-06-21 10:33:49",
    "status": "active",
    "upload_date": "2022-06-21T10:33:33",
    "url": "https://api.openml.org/data/v1/download/22103161/nyc-taxi-green-dec-2016.arff",
    "version": "9",
    "visibility": "public"
  }
}