{
  "data_qualities": {
    "quality": [
      {
        "name": "AutoCorrelation",
        "value": "0.048687049895252785"
      },
      {
        "name": "Dimensionality",
        "value": "0.0015134698819493492"
      },
      {
        "name": "MajorityClassPercentage",
        "value": []
      },
      {
        "name": "MajorityClassSize",
        "value": []
      },
      {
        "name": "MinorityClassPercentage",
        "value": []
      },
      {
        "name": "MinorityClassSize",
        "value": []
      },
      {
        "name": "NumberOfBinaryFeatures",
        "value": "14.0"
      },
      {
        "name": "NumberOfClasses",
        "value": "0.0"
      },
      {
        "name": "NumberOfFeatures",
        "value": "60.0"
      },
      {
        "name": "NumberOfInstances",
        "value": "39644.0"
      },
      {
        "name": "NumberOfInstancesWithMissingValues",
        "value": "0.0"
      },
      {
        "name": "NumberOfMissingValues",
        "value": "0.0"
      },
      {
        "name": "NumberOfNumericFeatures",
        "value": "46.0"
      },
      {
        "name": "NumberOfSymbolicFeatures",
        "value": "14.0"
      },
      {
        "name": "PercentageOfBinaryFeatures",
        "value": "23.333333333333332"
      },
      {
        "name": "PercentageOfInstancesWithMissingValues",
        "value": "0.0"
      },
      {
        "name": "PercentageOfMissingValues",
        "value": "0.0"
      },
      {
        "name": "PercentageOfNumericFeatures",
        "value": "76.66666666666667"
      },
      {
        "name": "PercentageOfSymbolicFeatures",
        "value": "23.333333333333332"
      }
    ]
  }
}