{
  "data_set_description": {
    "contributor": "Leo Grin",
    "default_target_attribute": "price",
    "description": "Dataset used in the tabular data benchmark https://github.com/LeoGrin/tabular-benchmark, transformed in the same way. This dataset belongs to the \"regression on numerical features\" benchmark. Original description: \n \nThis classic dataset contains the prices and other attributes of almost 54,000 diamonds. It's a great dataset for beginners learning to work with data analysis and visualization.\n\nContent\nprice price in US dollars (\\$326--\\$18,823)\n\ncarat weight of the diamond (0.2--5.01)\n\ncut quality of the cut (Fair, Good, Very Good, Premium, Ideal)\n\ncolor diamond colour, from J (worst) to D (best)\n\nclarity a measurement of how clear the diamond is (I1 (worst), SI2, SI1, VS2, VS1, VVS2, VVS1, IF (best))\n\nx length in mm (0--10.74)\n\ny width in mm (0--58.9)\n\nz depth in mm (0--31.8)\n\ndepth total depth percentage = z / mean(x, y) = 2 * z / (x + y) (43--79)\n\ntable width of top of diamond relative to widest point (43--95)",
    "description_version": "1",
    "file_id": "22103103",
    "format": "arff",
    "id": "44015",
    "language": "English",
    "licence": "public domain",
    "md5_checksum": "b5aa9d0255f4c0224c1361beec7ca668",
    "minio_url": "https://data.openml.org/datasets/0004/44015/dataset_44015.pq",
    "name": "diamonds",
    "parquet_url": "https://data.openml.org/datasets/0004/44015/dataset_44015.pq",
    "processing_date": "2022-06-16 21:28:49",
    "status": "active",
    "upload_date": "2022-06-16T21:13:14",
    "url": "https://api.openml.org/data/v1/download/22103103/diamonds.arff",
    "version": "3",
    "visibility": "public"
  }
}