{
  "data_set_description": {
    "collection_date": "20-03-2020",
    "contributor": "Leo Grin",
    "creator": "Kaggle",
    "default_target_attribute": "totalBRL",
    "description": "Dataset used in the tabular data benchmark https://github.com/LeoGrin/tabular-benchmark, transformed in the same way. This dataset belongs to the \"classification on numerical features\" benchmark. Original description: \n \n**Author**: Kaggle  \n**Source**: [original](https://www.kaggle.com/rubenssjr/brasilian-houses-to-rent) - 20-03-2020  \n**Please cite**:   \n\nThis dataset contains 10962 houses to rent with 13 diferent features.\n\n**Outliers **\nSome values in the dataset can be considered as outliers for further analyses. Bear in mind that the Web Crawler was used only to get the data, so it's possible that errors in the original data exist.\n\n**Changes in data between versions of dataset **\nSince the WebCrawler was ran in different days for each version of dataset, there may be differences like added or deleted houses (as well as added cities).\n\nNotes: \n\n1) This dataset corresponds to the 2nd version of the original dataset (\"houses_to_rent_v2.csv\").\n\n2) The value '-' in the attribute floor was replaced by '0' as the data contributor stated that this refers to houses with just one floor (see https://www.kaggle.com/rubenssjr/brasilian-houses-to-rent/discussion).",
    "description_version": "1",
    "file_id": "22103087",
    "format": "arff",
    "id": "43999",
    "language": "English",
    "licence": "Public",
    "md5_checksum": "7af56bc3568ba1e3fd7394e373423513",
    "minio_url": "https://data.openml.org/datasets/0004/43999/dataset_43999.pq",
    "name": "Brazilian_houses",
    "parquet_url": "https://data.openml.org/datasets/0004/43999/dataset_43999.pq",
    "processing_date": "2022-06-16 20:51:38",
    "status": "active",
    "upload_date": "2022-06-16T20:51:36",
    "url": "https://api.openml.org/data/v1/download/22103087/Brazilian_houses.arff",
    "version": "5",
    "visibility": "public"
  }
}