{
  "data_set_description": {
    "collection_date": "2014-08-18",
    "contributor": "Leo Grin",
    "creator": [
      "Luis Torgo",
      "Rui Camacho"
    ],
    "default_target_attribute": "goal",
    "description": "Dataset used in the tabular data benchmark https://github.com/LeoGrin/tabular-benchmark, transformed in the same way. This dataset belongs to the \"classification on numerical features\" benchmark. Original description: \n \n**Author**: Luis Torgo\",\"Rui Camacho  \n**Source**: Unknown - 2014-08-18  \n**Please cite**:   \n\nThis data set addresses a control problem, namely flying a F16 aircraft. The attributes describe the status of the aeroplane, while the goal is to predict the control action on the ailerons of the aircraft.",
    "description_version": "1",
    "file_id": "22103083",
    "format": "arff",
    "id": "43995",
    "language": "English",
    "licence": "Public",
    "md5_checksum": "b62ab59c8735db940aab970d57c451be",
    "minio_url": "https://data.openml.org/datasets/0004/43995/dataset_43995.pq",
    "name": "Ailerons",
    "parquet_url": "https://data.openml.org/datasets/0004/43995/dataset_43995.pq",
    "processing_date": "2022-06-16 20:51:35",
    "status": "active",
    "upload_date": "2022-06-16T20:50:39",
    "url": "https://api.openml.org/data/v1/download/22103083/Ailerons.arff",
    "version": "4",
    "visibility": "public"
  }
}