{
  "data_set_description": {
    "contributor": "Leo Grin",
    "default_target_attribute": "binaryClass",
    "description": "Dataset used in the tabular data benchmark https://github.com/LeoGrin/tabular-benchmark, transformed in the same way. This dataset belongs to the \"classification on numerical features\" benchmark. Original description: \n \n**Author**:   \n**Source**: Unknown - Date unknown  \n**Please cite**:   \n\nBinarized version of the original data set (see version 1). It converts the numeric target feature to a two-class nominal target feature by computing the mean and classifying all instances with a lower target value as positive ('P') and all others as negative ('N').",
    "description_version": "1",
    "file_id": "22103056",
    "format": "arff",
    "id": "43968",
    "licence": "Public",
    "md5_checksum": "d44c3c97123c0a9bb9299fa41902ca76",
    "minio_url": "https://data.openml.org/datasets/0004/43968/dataset_43968.pq",
    "name": "pol",
    "parquet_url": "https://data.openml.org/datasets/0004/43968/dataset_43968.pq",
    "processing_date": "2022-06-16 19:20:03",
    "status": "active",
    "upload_date": "2022-06-16T19:19:19",
    "url": "https://api.openml.org/data/v1/download/22103056/pol.arff",
    "version": "4",
    "visibility": "public"
  }
}