{
  "data_set_description": {
    "collection_date": "1998-12-05",
    "contributor": "Leo Grin",
    "creator": [
      "M. Harries",
      "J. Gama",
      "A. Bifet"
    ],
    "default_target_attribute": "class",
    "description": "Dataset used in the tabular data benchmark https://github.com/LeoGrin/tabular-benchmark, transformed in the same way. This dataset belongs to the \"classification on numerical features\" benchmark. Original description: \n \n**Author**: M. Harries, J. Gama, A. Bifet  \n**Source**: [Joao Gama](http://www.inescporto.pt/~jgama/ales/ales_5.html) - 2009  \n**Please cite**: None  \n\n**Electricity** is a widely used dataset described by M. Harries and analyzed by J. Gama (see papers below). This data was collected from the Australian New South Wales Electricity Market. In this market, prices are not fixed and are affected by demand and supply of the market. They are set every five minutes. Electricity transfers to/from the neighboring state of Victoria were done to alleviate fluctuations.\n\nThe dataset (originally named ELEC2) contains 45,312 instances dated from 7 May 1996 to 5 December 1998. Each example of the dataset refers to a period of 30 minutes, i.e. there are 48 instances for each time period of one day. Each example on the dataset has 5 fields, the day of week, the time stamp, the New South Wales electricity demand, the Victoria electricity demand, the scheduled electricity transfer between states and the class label. The class label identifies the change of the price (UP or DOWN) in New South Wales relative to a moving average of the last 24 hours (and removes the impact of longer term price trends). \n\nThe data was normalized by A. Bifet.\n\n### Attribute information  \n* Date: date between 7 May 1996 to 5 December 1998. Here normalized between 0 and 1\n* Day: day of the week (1-7)\n* Period: time of the measurement (1-48) in half hour intervals over 24 hours. Here normalized between 0 and 1\n* NSWprice: New South Wales electricity price, normalized between 0 and 1\n* NSWdemand: New South Wales electricity demand, normalized between 0 and 1\n* VICprice: Victoria electricity price, normalized between 0 and 1\n* VICdemand: Victoria electricity demand, normalized between 0 and 1\n* transfer: scheduled electricity transfer between both states, normalized between 0 and 1\n\n### Relevant papers  \nM. Harries. Splice-2 comparative evaluation: Electricity pricing. Technical report, The University of South Wales, 1999.  \nJ. Gama, P. Medas, G. Castillo, and P. Rodrigues. Learning with drift detection. In SBIA Brazilian Symposium on Artificial Intelligence, pages 286-295, 2004.",
    "description_version": "1",
    "file_id": "22103037",
    "format": "arff",
    "id": "43951",
    "language": "English",
    "licence": "Public",
    "md5_checksum": "1be3d2fa126d6f95db2cbf0e54294086",
    "minio_url": "https://data.openml.org/datasets/0004/43951/dataset_43951.pq",
    "name": "electricity",
    "parquet_url": "https://data.openml.org/datasets/0004/43951/dataset_43951.pq",
    "processing_date": "2022-06-15 20:34:07",
    "status": "active",
    "upload_date": "2022-06-15T20:34:06",
    "url": "https://api.openml.org/data/v1/download/22103037/electricity.arff",
    "version": "4",
    "version_label": "1",
    "visibility": "public"
  }
}