{
  "data_features": {
    "feature": [
      {
        "data_type": "numeric",
        "index": "0",
        "is_ignore": "false",
        "is_row_identifier": "false",
        "is_target": "false",
        "name": "date",
        "number_of_missing_values": "0"
      },
      {
        "data_type": "nominal",
        "index": "1",
        "is_ignore": "false",
        "is_row_identifier": "false",
        "is_target": "false",
        "name": "period",
        "nominal_value": [
          "0.0",
          "0.021277",
          "0.042553",
          "0.06383",
          "0.085106",
          "0.106383",
          "0.12766",
          "0.148936",
          "0.170213",
          "0.191489",
          "0.212766",
          "0.234043",
          "0.255319",
          "0.276596",
          "0.297872",
          "0.319149",
          "0.340426",
          "0.361702",
          "0.382979",
          "0.404255",
          "0.425532",
          "0.446809",
          "0.468085",
          "0.489362",
          "0.510638",
          "0.531915",
          "0.553191",
          "0.574468",
          "0.595745",
          "0.617021",
          "0.638298",
          "0.659574",
          "0.680851",
          "0.702128",
          "0.723404",
          "0.744681",
          "0.765957",
          "0.787234",
          "0.808511",
          "0.829787",
          "0.851064",
          "0.87234",
          "0.893617",
          "0.914894",
          "0.93617",
          "0.957447",
          "0.978723",
          "1.0"
        ],
        "number_of_missing_values": "0"
      },
      {
        "data_type": "numeric",
        "index": "2",
        "is_ignore": "false",
        "is_row_identifier": "false",
        "is_target": "false",
        "name": "nswprice",
        "number_of_missing_values": "0"
      },
      {
        "data_type": "numeric",
        "index": "3",
        "is_ignore": "false",
        "is_row_identifier": "false",
        "is_target": "false",
        "name": "nswdemand",
        "number_of_missing_values": "0"
      },
      {
        "data_type": "numeric",
        "index": "4",
        "is_ignore": "false",
        "is_row_identifier": "false",
        "is_target": "false",
        "name": "vicprice",
        "number_of_missing_values": "0"
      },
      {
        "data_type": "numeric",
        "index": "5",
        "is_ignore": "false",
        "is_row_identifier": "false",
        "is_target": "false",
        "name": "vicdemand",
        "number_of_missing_values": "0"
      },
      {
        "data_type": "numeric",
        "index": "6",
        "is_ignore": "false",
        "is_row_identifier": "false",
        "is_target": "false",
        "name": "transfer",
        "number_of_missing_values": "0"
      },
      {
        "data_type": "string",
        "index": "7",
        "is_ignore": "false",
        "is_row_identifier": "false",
        "is_target": "true",
        "name": "class",
        "number_of_missing_values": "0"
      }
    ]
  }
}