{
  "data_set_description": {
    "default_target_attribute": "Class",
    "description": "jobScheduling: HPC Job Scheduling Data\nIn AppliedPredictiveModeling: Functions and Data Sets for 'Applied Predictive Modeling'",
    "description_version": "1",
    "file_id": "22102973",
    "format": "ARFF",
    "id": "43925",
    "licence": "public",
    "md5_checksum": "4cbf7f72a05ceae771daa7e1e97fd983",
    "minio_url": "https://data.openml.org/datasets/0004/43925/dataset_43925.pq",
    "name": "eucalyptus",
    "original_data_url": "https://rdrr.io/rforge/AppliedPredictiveModeling/man/jobScheduling.html",
    "parquet_url": "https://data.openml.org/datasets/0004/43925/dataset_43925.pq",
    "processing_date": "2022-06-04 16:58:02",
    "status": "active",
    "upload_date": "2022-06-04T16:57:48",
    "url": "https://api.openml.org/data/v1/download/22102973/eucalyptus.arff",
    "version": "4",
    "visibility": "public"
  }
}