{
  "data_features": {
    "feature": [
      {
        "data_type": "numeric",
        "index": "0",
        "is_ignore": "false",
        "is_row_identifier": "false",
        "is_target": "false",
        "name": "age",
        "number_of_missing_values": "0"
      },
      {
        "data_type": "numeric",
        "index": "1",
        "is_ignore": "false",
        "is_row_identifier": "false",
        "is_target": "false",
        "name": "decile1",
        "number_of_missing_values": "0"
      },
      {
        "data_type": "numeric",
        "index": "2",
        "is_ignore": "false",
        "is_row_identifier": "false",
        "is_target": "false",
        "name": "decile3",
        "number_of_missing_values": "0"
      },
      {
        "data_type": "numeric",
        "index": "3",
        "is_ignore": "false",
        "is_row_identifier": "false",
        "is_target": "false",
        "name": "fam_inc",
        "number_of_missing_values": "0"
      },
      {
        "data_type": "numeric",
        "index": "4",
        "is_ignore": "false",
        "is_row_identifier": "false",
        "is_target": "false",
        "name": "lsat",
        "number_of_missing_values": "0"
      },
      {
        "data_type": "numeric",
        "index": "5",
        "is_ignore": "false",
        "is_row_identifier": "false",
        "is_target": "false",
        "name": "ugpa",
        "number_of_missing_values": "0"
      },
      {
        "data_type": "nominal",
        "index": "6",
        "is_ignore": "false",
        "is_row_identifier": "false",
        "is_target": "false",
        "name": "gender",
        "nominal_value": [
          "female",
          "male"
        ],
        "number_of_missing_values": "0"
      },
      {
        "data_type": "nominal",
        "index": "7",
        "is_ignore": "false",
        "is_row_identifier": "false",
        "is_target": "false",
        "name": "race1",
        "nominal_value": [
          "non-white",
          "white"
        ],
        "number_of_missing_values": "0"
      },
      {
        "data_type": "nominal",
        "index": "8",
        "is_ignore": "false",
        "is_row_identifier": "false",
        "is_target": "false",
        "name": "cluster",
        "nominal_value": [
          "1",
          "2",
          "3",
          "4",
          "5",
          "6"
        ],
        "number_of_missing_values": "0"
      },
      {
        "data_type": "nominal",
        "index": "9",
        "is_ignore": "false",
        "is_row_identifier": "false",
        "is_target": "false",
        "name": "fulltime",
        "nominal_value": [
          "1",
          "2"
        ],
        "number_of_missing_values": "0"
      },
      {
        "data_type": "nominal",
        "index": "10",
        "is_ignore": "false",
        "is_row_identifier": "false",
        "is_target": "false",
        "name": "bar",
        "nominal_value": [
          "FALSE",
          "TRUE"
        ],
        "number_of_missing_values": "0"
      },
      {
        "data_type": "numeric",
        "index": "11",
        "is_ignore": "false",
        "is_row_identifier": "false",
        "is_target": "true",
        "name": "ugpagt3",
        "number_of_missing_values": "0"
      }
    ]
  }
}