{
  "data_set_description": {
    "citation": "Yahoo Finance",
    "collection_date": "18-5-2022",
    "creator": "Yahoo Finance",
    "default_target_attribute": "Close",
    "description": "Apple stock price of each work day since January 1st 2021. Contains highest price, lowest price,     open, close, volume and adjusted close",
    "description_version": "1",
    "file_id": "22102779",
    "format": "arff",
    "id": "43878",
    "language": "English",
    "licence": "Public",
    "md5_checksum": "f63ff59096deffe3598445856fb5ab12",
    "minio_url": "https://data.openml.org/datasets/0004/43878/dataset_43878.pq",
    "name": "AAPL_stock_price_2021_2022",
    "parquet_url": "https://data.openml.org/datasets/0004/43878/dataset_43878.pq",
    "processing_date": "2022-05-18 12:04:09",
    "row_id_attribute": "Date",
    "status": "active",
    "upload_date": "2022-05-18T12:03:39",
    "url": "https://api.openml.org/data/v1/download/22102779/AAPL_stock_price_2021_2022.arff",
    "version": "1",
    "version_label": "example",
    "visibility": "public"
  }
}