{
  "data_set_description": {
    "collection_date": "04-11-2019",
    "description": "Context\nThe card payments data is published by the Reserve Bank of India on a monthly basis. The statistics cover the methods of payment used in retail transactions and ATM transactions in India. It constitutes payments via debit cards, credit cards, ATMs etc, . It can can be used to check trend of card based payment in India.\nContent\nThe data contains monthly statistics of the following information from Apr'2011 to Aug'2019\n\nNumber of ATM deployed on site by the bank.\nNumber of ATM deployed off site by the bank.\nNumber of POS deployed online by the bank\nNumber of POS deployed offline by the bank\nTotal number of credit cards issued outstanding (after adjusting the number of cards withdrawan/cancelled).\nTotal number of financial transactions done by the credit card issued by the bank at ATMs\nTotal number of financial transactions done by the credit card issued by the bank at POS terminals\nTotal value of financial transactions done by the credit card issued by the bank at ATMs\nTotal value of financial transactions done by the credit card issued by the bank at POS terminals.\nTotal number of debit cards issued outstanding (after adjusting the number of cards withdrawan/cancelled).\nTotal number of financial transactions done by the debit card issued by the bank at ATMs\nTotal number of financial transactions done by the debit card issued by the bank at POS terminals\nTotal value of financial transactions done by the debit card issued by the bank at ATMs\nTotal value of financial transactions done by the debit card issued by the bank at POS terminals.\n\nAcknowledgements\nThe data is scraped from RBI monthly statistics\nhttps://www.rbi.org.in/scripts/ATMView.aspx\nMore details on how this data is collected and cleaned is documented in this kernel\nhttps://www.kaggle.com/karvalo/indian-card-payment-data-gathering-and-analysis",
    "description_version": "1",
    "file_id": "22102655",
    "format": "arff",
    "id": "43830",
    "language": "English",
    "licence": "CC0: Public Domain",
    "md5_checksum": "558cfea6672511411028000e952f2a81",
    "minio_url": "https://data.openml.org/datasets/0004/43830/dataset_43830.pq",
    "name": "Indian-card-payment-data-set",
    "parquet_url": "https://data.openml.org/datasets/0004/43830/dataset_43830.pq",
    "processing_date": "2022-03-24 15:32:09",
    "status": "active",
    "upload_date": "2022-03-24T15:31:36",
    "url": "https://api.openml.org/data/v1/download/22102655/Indian-card-payment-data-set.arff",
    "version": "1",
    "version_label": "v1.0",
    "visibility": "public"
  }
}