{
  "data_set_description": {
    "collection_date": "13-08-2020",
    "description": "Context\nTeleport.org provides data related to quality of life for the most creative cities around the world, which enables users to find suitable cities for living and working according to their personal preferences.\nThis dataset was obtained from Teleport API endpoints (https://developers.teleport.org/api/) and pre-processed before being uploaded to Kaggle.",
    "description_version": "1",
    "file_id": "22102652",
    "format": "arff",
    "id": "43827",
    "language": "English",
    "licence": "CC0: Public Domain",
    "md5_checksum": "dbe11a21955bfdcf416c913641b138e4",
    "minio_url": "https://data.openml.org/datasets/0004/43827/dataset_43827.pq",
    "name": "City-Quality-of-Life-Dataset",
    "parquet_url": "https://data.openml.org/datasets/0004/43827/dataset_43827.pq",
    "processing_date": "2022-03-24 15:31:21",
    "status": "active",
    "upload_date": "2022-03-24T15:31:18",
    "url": "https://api.openml.org/data/v1/download/22102652/City-Quality-of-Life-Dataset.arff",
    "version": "1",
    "version_label": "v1.0",
    "visibility": "public"
  }
}