{
  "data_qualities": {
    "quality": [
      {
        "name": "AutoCorrelation",
        "value": []
      },
      {
        "name": "Dimensionality",
        "value": "0.008760951188986232"
      },
      {
        "name": "MajorityClassPercentage",
        "value": []
      },
      {
        "name": "MajorityClassSize",
        "value": []
      },
      {
        "name": "MinorityClassPercentage",
        "value": []
      },
      {
        "name": "MinorityClassSize",
        "value": []
      },
      {
        "name": "NumberOfBinaryFeatures",
        "value": "0.0"
      },
      {
        "name": "NumberOfClasses",
        "value": []
      },
      {
        "name": "NumberOfFeatures",
        "value": "77.0"
      },
      {
        "name": "NumberOfInstances",
        "value": "8789.0"
      },
      {
        "name": "NumberOfInstancesWithMissingValues",
        "value": "1590.0"
      },
      {
        "name": "NumberOfMissingValues",
        "value": "1590.0"
      },
      {
        "name": "NumberOfNumericFeatures",
        "value": "3.0"
      },
      {
        "name": "NumberOfSymbolicFeatures",
        "value": "0.0"
      },
      {
        "name": "PercentageOfBinaryFeatures",
        "value": "0.0"
      },
      {
        "name": "PercentageOfInstancesWithMissingValues",
        "value": "18.09079531232222"
      },
      {
        "name": "PercentageOfMissingValues",
        "value": "0.23494539366652234"
      },
      {
        "name": "PercentageOfNumericFeatures",
        "value": "3.896103896103896"
      },
      {
        "name": "PercentageOfSymbolicFeatures",
        "value": "0.0"
      }
    ]
  }
}