{
  "data_set_description": {
    "collection_date": "23-04-2020",
    "description": "Context\nSince 2008, guests and hosts have used Airbnb to travel in a more unique, personalized way. As part of the Airbnb Inside initiative, this dataset describes the listing activity of homestays in Boston, MA. \nContent\nThis data file includes all needed information to about the listing details, the host, geographical availability, and necessary metrics to make predictions and draw conclusions. Basic data cleaning has been done, such as dropping redundant features (ex: city) and converting amenities into a dictionary. The data includes both numerical and categorical data, as well as natural language descriptions. \nAcknowledgements\nThis dataset is part of Airbnb Inside, and the original source can be found here.\nInspiration\n\nListing visualization\nWhat features drive the price of a listing up?\nWhat can we learn about different hosts and areas?\nWhat can we learn from predictions? (ex: locations, prices, reviews, etc)\nWhich hosts are the busiest and why?\nIs there any noticeable difference of traffic among different areas and what could be the reason for it?",
    "description_version": "1",
    "file_id": "22102644",
    "format": "arff",
    "id": "43819",
    "language": "English",
    "licence": "CC0: Public Domain",
    "md5_checksum": "8c6f9e2c855789be0c1303c9fddd7681",
    "minio_url": "https://data.openml.org/datasets/0004/43819/dataset_43819.pq",
    "name": "Boston-Airbnb-Listings",
    "parquet_url": "https://data.openml.org/datasets/0004/43819/dataset_43819.pq",
    "processing_date": "2022-03-24 15:30:23",
    "status": "active",
    "upload_date": "2022-03-24T15:30:20",
    "url": "https://api.openml.org/data/v1/download/22102644/Boston-Airbnb-Listings.arff",
    "version": "1",
    "version_label": "v1.0",
    "visibility": "public"
  }
}