{
  "data_qualities": {
    "quality": [
      {
        "name": "AutoCorrelation",
        "value": []
      },
      {
        "name": "Dimensionality",
        "value": "9.239930187194142E-4"
      },
      {
        "name": "MajorityClassPercentage",
        "value": []
      },
      {
        "name": "MajorityClassSize",
        "value": []
      },
      {
        "name": "MinorityClassPercentage",
        "value": []
      },
      {
        "name": "MinorityClassSize",
        "value": []
      },
      {
        "name": "NumberOfBinaryFeatures",
        "value": "0.0"
      },
      {
        "name": "NumberOfClasses",
        "value": []
      },
      {
        "name": "NumberOfFeatures",
        "value": "27.0"
      },
      {
        "name": "NumberOfInstances",
        "value": "29221.0"
      },
      {
        "name": "NumberOfInstancesWithMissingValues",
        "value": "12445.0"
      },
      {
        "name": "NumberOfMissingValues",
        "value": "53518.0"
      },
      {
        "name": "NumberOfNumericFeatures",
        "value": "26.0"
      },
      {
        "name": "NumberOfSymbolicFeatures",
        "value": "0.0"
      },
      {
        "name": "PercentageOfBinaryFeatures",
        "value": "0.0"
      },
      {
        "name": "PercentageOfInstancesWithMissingValues",
        "value": "42.58923377023373"
      },
      {
        "name": "PercentageOfMissingValues",
        "value": "6.783300188727792"
      },
      {
        "name": "PercentageOfNumericFeatures",
        "value": "96.29629629629629"
      },
      {
        "name": "PercentageOfSymbolicFeatures",
        "value": "0.0"
      }
    ]
  }
}