{
  "data_set_description": {
    "collection_date": "08-11-2019",
    "description": "MAGIC gamma telescope data 2004\nDataset Information.\nThe data are MC generated (see below) to simulate registration of high energy\n   gamma particles in a ground-based atmospheric Cherenkov gamma telescope using the\n   imaging technique. Cherenkov gamma telescope observes high energy gamma rays,\n   taking advantage of the radiation emitted by charged particles produced\n   inside the electromagnetic showers initiated by the gammas, and developing in the\n   atmosphere. This Cherenkov radiation (of visible to UV wavelengths) leaks\n   through the atmosphere and gets recorded in the detector, allowing reconstruction\n   of the shower parameters. The available information consists of pulses left by\n   the incoming Cherenkov photons on the photomultiplier tubes, arranged in a\n   plane, the camera. Depending on the energy of the primary gamma, a total of\n   few hundreds to some 10000 Cherenkov photons get collected, in patterns\n   (called the shower image), allowing to discriminate statistically those\n   caused by primary gammas (signal) from the images of hadronic showers\n   initiated by cosmic rays in the upper atmosphere (background).\nTypically, the image of a shower after some pre-processing is an elongated\n   cluster. Its long axis is oriented towards the camera center if the shower axis\n   is parallel to the telescope's optical axis, i.e. if the telescope axis is\n   directed towards a point source. A principal component analysis is performed\n   in the camera plane, which results in a correlation axis and defines an ellipse.\n   If the depositions were distributed as a bivariate Gaussian, this would be\n   an equidensity ellipse. The characteristic parameters of this ellipse\n   (often called Hillas parameters) are among the image parameters that can be\n   used for discrimination. The energy depositions are typically asymmetric\n   along the major axis, and this asymmetry can also be used in discrimination.\n   There are, in addition, further discriminating characteristics, like the\n   extent of the cluster in the image plane, or the total sum of depositions.\nThe data set was generated by a Monte Carlo program, Corsika, described in \n      D. Heck et al., CORSIKA, A Monte Carlo code to simulate extensive air showers,\n      Forschungszentrum Karlsruhe FZKA 6019 (1998).\n   The program was run with parameters allowing to observe events with energies down\n   to below 50 GeV.\nNumber of Instances: 19020\nNumber of Attributes: 11 (including the class)\nAttribute information:\n1.  fLength:  continuous  -  major axis of ellipse [mm]\n2.  fWidth:   continuous  - minor axis of ellipse [mm] \n3.  fSize:    continuous  - 10-log of sum of content of all pixels [in phot]\n4.  fConc:    continuous  - ratio of sum of two highest pixels over fSize  [ratio]\n5.  fConc1:   continuous  - ratio of highest pixel over fSize  [ratio]\n6.  fAsym:    continuous  - distance from highest pixel to center, projected onto major axis [mm]\n7.  fM3Long:  continuous  - 3rd root of third moment along major axis  [mm] \n8.  fM3Trans: continuous  - 3rd root of third moment along minor axis  [mm]\n9.  fAlpha:   continuous  - angle of major axis with vector to origin [deg]\n10.  fDist:    continuous  - distance from origin to center of ellipse [mm]\n11.  class:    g,h  - gamma (signal), hadron (background)\n\nMissing Attribute Values: None\nClass Distribution:\n  g = gamma (signal):     12332\n  h = hadron (background): 6688\n\nFor technical reasons, the number of h events is underestimated.\n   In the real data, the h class represents the majority of the events.\nThe simple classification accuracy is not meaningful for this data, since\n   classifying a background event as signal is worse than classifying a signal\n   event as background. For comparison of different classifiers an ROC curve\n   has to be used. The relevant points on this curve are those, where the\n   probability of accepting a background event as signal is below one of the\n   following thresholds: 0.01, 0.02, 0.05, 0.1, 0.2 depending on the required\n   quality of the sample of the accepted events for different experiments.\nSources:\n(a) Original owner of the database:\n   R. K. Bock\n   Major Atmospheric Gamma Imaging Cherenkov Telescope project (MAGIC)\n   http://wwwmagic.mppmu.mpg.de\n   rkbmail.cern.ch\n\n(b) Donor:\n   P. Savicky\n   Institute of Computer Science, AS of CR\n   Czech Republic\n   savickycs.cas.cz\n\n(c) Date received: May 2007\nPast Usage:\n(a) Bock, R.K., Chilingarian, A., Gaug, M., Hakl, F., Hengstebeck, T.,\n       Jirina, M., Klaschka, J., Kotrc, E., Savicky, P., Towers, S.,\n       Vaicilius, A., Wittek W. (2004).\n       Methods for multidimensional event classification: a case study\n       using images from a Cherenkov gamma-ray telescope.\n       Nucl.Instr.Meth. A, 516, pp. 511-528.\n(b) P. Savicky, E. Kotrc.\n       Experimental Study of Leaf Confidences for Random Forest.\n       Proceedings of COMPSTAT 2004, In: Computational Statistics.\n       (Ed.: Antoch J.) - Heidelberg, Physica Verlag 2004, pp. 1767-1774.\n(c) J. Dvorak, P. Savicky.\n       Softening Splits in Decision Trees Using Simulated Annealing.\n       Proceedings of ICANNGA 2007, Warsaw, (Ed.: Beliczynski et. al),\n       Part I, LNCS 4431, pp. 721-729.",
    "description_version": "1",
    "file_id": "22102629",
    "format": "arff",
    "id": "43804",
    "language": "English",
    "licence": "Database: Open Database, Contents:  Original Authors",
    "md5_checksum": "af9d1d92f5e061ba65ea42c72656966c",
    "minio_url": "https://data.openml.org/datasets/0004/43804/dataset_43804.pq",
    "name": "MAGIC-Gamma-Telescope-Dataset",
    "parquet_url": "https://data.openml.org/datasets/0004/43804/dataset_43804.pq",
    "processing_date": "2022-03-24 11:44:58",
    "status": "active",
    "upload_date": "2022-03-24T11:42:58",
    "url": "https://api.openml.org/data/v1/download/22102629/MAGIC-Gamma-Telescope-Dataset.arff",
    "version": "1",
    "version_label": "v1.0",
    "visibility": "public"
  }
}