{
  "data_set_description": {
    "collection_date": "29-01-2021",
    "default_target_attribute": "Avg_Rating",
    "description": "Context\nThe reason for creating this dataset is the requirement of a good clean dataset of computer books. I had searched for datasets on books in Kaggle and I found out that while most of the datasets had a good amount of books listed, there were either major columns missing or grossly unclean data. I mean, you can't determine how good a book is just from a few text reviews. So I collected this data from the Goodreads website from the \"Computer\" category to help people who are like this type of book.\nAcknowledgements\nThis data was entirely scraped via the Webdriver\nInspiration\nThe reason behind creating this dataset is pretty straightforward, I'm listing the books for all who need computer books, irrespective of the language and publication and all of that. So go ahead and use it to your liking, find out what book you should be reading next,  all possible approaches to exploring this dataset are welcome.\nI started creating this dataset on Jan 18, 2021, and intend to update it frequently.\nP.S. If you like this, please don't forget to give an upvote!\nNotes\nThe missing values are imputed in this data by the creator.",
    "description_version": "1",
    "file_id": "22102610",
    "format": "arff",
    "id": "43785",
    "ignore_attribute": "Book_Id",
    "language": "English",
    "licence": "CC0: Public Domain",
    "md5_checksum": "fd97b198df80ace3c91e4fab880d1340",
    "minio_url": "https://data.openml.org/datasets/0004/43785/dataset_43785.pq",
    "name": "Goodreads-Computer-Books",
    "parquet_url": "https://data.openml.org/datasets/0004/43785/dataset_43785.pq",
    "processing_date": "2022-03-24 10:27:19",
    "status": "active",
    "upload_date": "2022-03-24T10:27:04",
    "url": "https://api.openml.org/data/v1/download/22102610/Goodreads-Computer-Books.arff",
    "version": "1",
    "version_label": "v1.0",
    "visibility": "public"
  }
}