{
  "data_features": {
    "feature": [
      {
        "data_type": "string",
        "index": "0",
        "is_ignore": "false",
        "is_row_identifier": "false",
        "is_target": "false",
        "name": "City",
        "number_of_missing_values": "0"
      },
      {
        "data_type": "string",
        "index": "1",
        "is_ignore": "false",
        "is_row_identifier": "false",
        "is_target": "false",
        "name": "Country",
        "number_of_missing_values": "0"
      },
      {
        "data_type": "numeric",
        "index": "2",
        "is_ignore": "false",
        "is_row_identifier": "false",
        "is_target": "false",
        "name": "Housing_Affordability",
        "number_of_missing_values": "0"
      },
      {
        "data_type": "numeric",
        "index": "3",
        "is_ignore": "false",
        "is_row_identifier": "false",
        "is_target": "false",
        "name": "Living_Costs_by_Income",
        "number_of_missing_values": "0"
      },
      {
        "data_type": "numeric",
        "index": "4",
        "is_ignore": "false",
        "is_row_identifier": "false",
        "is_target": "false",
        "name": "Unemployment",
        "number_of_missing_values": "0"
      },
      {
        "data_type": "numeric",
        "index": "5",
        "is_ignore": "false",
        "is_row_identifier": "false",
        "is_target": "false",
        "name": "Education",
        "number_of_missing_values": "0"
      },
      {
        "data_type": "numeric",
        "index": "6",
        "is_ignore": "false",
        "is_row_identifier": "false",
        "is_target": "false",
        "name": "Safety",
        "number_of_missing_values": "0"
      },
      {
        "data_type": "numeric",
        "index": "7",
        "is_ignore": "false",
        "is_row_identifier": "false",
        "is_target": "false",
        "name": "Mobility",
        "number_of_missing_values": "0"
      },
      {
        "data_type": "numeric",
        "index": "8",
        "is_ignore": "false",
        "is_row_identifier": "false",
        "is_target": "false",
        "name": "Air_Quality",
        "number_of_missing_values": "0"
      },
      {
        "data_type": "numeric",
        "index": "9",
        "is_ignore": "false",
        "is_row_identifier": "false",
        "is_target": "false",
        "name": "Healthcare",
        "number_of_missing_values": "0"
      },
      {
        "data_type": "numeric",
        "index": "10",
        "is_ignore": "false",
        "is_row_identifier": "false",
        "is_target": "false",
        "name": "Kids_Activities",
        "number_of_missing_values": "0"
      },
      {
        "data_type": "numeric",
        "index": "11",
        "is_ignore": "false",
        "is_row_identifier": "false",
        "is_target": "false",
        "name": "Paid_Parental_Leave",
        "number_of_missing_values": "0"
      },
      {
        "data_type": "numeric",
        "index": "12",
        "is_ignore": "false",
        "is_row_identifier": "false",
        "is_target": "false",
        "name": "Family_Inclusivity",
        "number_of_missing_values": "0"
      },
      {
        "data_type": "numeric",
        "index": "13",
        "is_ignore": "false",
        "is_row_identifier": "false",
        "is_target": "false",
        "name": "Neighbourhood_Safety",
        "number_of_missing_values": "0"
      },
      {
        "data_type": "numeric",
        "index": "14",
        "is_ignore": "false",
        "is_row_identifier": "false",
        "is_target": "false",
        "name": "Family-Friendliness",
        "number_of_missing_values": "0"
      },
      {
        "data_type": "numeric",
        "index": "15",
        "is_ignore": "false",
        "is_row_identifier": "false",
        "is_target": "false",
        "name": "Total",
        "number_of_missing_values": "0"
      },
      {
        "data_type": "numeric",
        "index": "16",
        "is_ignore": "false",
        "is_row_identifier": "false",
        "is_target": "false",
        "name": "Lat",
        "number_of_missing_values": "0"
      },
      {
        "data_type": "numeric",
        "index": "17",
        "is_ignore": "false",
        "is_row_identifier": "false",
        "is_target": "false",
        "name": "Long",
        "number_of_missing_values": "0"
      }
    ]
  }
}