{
  "data_set_description": {
    "collection_date": "10-08-2020",
    "description": "Context\nThese data come from a camera that is part of the Telraam device which makes counting cameras available to interested citizens. \nhttps://www.telraam.net/fr/what-is-telraam\nThis camera is located, place gnral de gaulle, Paris (mouans sartoux, France)\nhttps://www.telraam.net/fr/location/9000000411\nWhat exactly does the Telraam measure ?\nTelraam counts pedestrians, cyclists, cars and freight/heavy vehicles. This is done using images taken by the device camera and the analysis performed by the Raspberry Pi (a small computer on which the device is based). The analysis simply uses the size and speed of the passing object.\nEach hour the camera records the following data:\n\nPercentage of camera activity\nCounting of pedestrians, cars, bicycles, trucks (total, left and right of the street)\nHistogram of car speeds for the intervals [0-10 [[10-20 [[20- 30 [.. [70 and more [\n\nWhy a percentage of camera activity ?\nTelraam does not count when it is dark.\nThis camera has constraints, because to perform the counts, it does image recognition:\n\nThe camera is not active at night\nThe camera is not active 100 of the time in daylight, therefore the percentage of activity is indicated. When the camera is partially active, the counts are prorated using this percentage to estimate the activity in the observed hour.\nThe camera may be out of service for a period\n\nContent\nThe data has been flatten in a csv file.\nThe original data (json) can be retrieved in real time here with a POST : https://telraam-api.net/v0/reports/9000000411\nThe API Documentation:  https://telraam.zendesk.com/hc/en-us/articles/360027325572-Want-more-data-Telraam-API\nColumns\n['time','id','timezone','pctup','pedestrian','bike','car','lorry','pedestrianlft','bikelft','carlft','lorrylft','pedestrianrgt','bikergt','carrgt','lorryrgt','carspeed00','carspeed10','carspeed20','carspeed30','carspeed40','carspeed50','carspeed60','carspeed_70']\nInspiration\nTime series forecasting : predict traffic flow",
    "description_version": "1",
    "file_id": "22102593",
    "format": "arff",
    "id": "43768",
    "language": "English",
    "licence": "CC0: Public Domain",
    "md5_checksum": "d419350fcb55ee2fbfcf3f7c34c814e2",
    "minio_url": "https://data.openml.org/datasets/0004/43768/dataset_43768.pq",
    "name": "Traffic-counting-using-cameras",
    "parquet_url": "https://data.openml.org/datasets/0004/43768/dataset_43768.pq",
    "processing_date": "2022-03-24 10:20:59",
    "status": "active",
    "upload_date": "2022-03-24T10:19:23",
    "url": "https://api.openml.org/data/v1/download/22102593/Traffic-counting-using-cameras.arff",
    "version": "1",
    "version_label": "v1.0",
    "visibility": "public"
  }
}