{
  "data_set_description": {
    "collection_date": "12-09-2020",
    "description": "Context\nA compilation of all the development related courses ( 10 thousand courses) which are available on Udemy's website. Under the development category, there are courses from Web Development, Data Science, Mobile App, Programming Languages, Game Development, Databases, Software Testing, Software Engineering, Development Tools and E-commerce each having multiple courses under it's domain.\nAll the details can be found on Udemy's website as well!\nContent\nHere, I have extracted data related to 10k courses which come under the development category on Udemy's website.\nThe 17 columns in the dataset can be used to gain insights related to:\n\nid : The course ID of that particular course.\ntitle : Shows the unique names of the courses available under the development category on Udemy.\nurl: Gives the URL of the course.\nis_paid : Returns a boolean value displaying true if the course is paid and false if otherwise.\nnum_subscribers : Shows the number of people who have subscribed that course.\navg_rating : Shows the average rating of the course.\navg rating recent : Reflects the recent changes in the average rating.\nnum_reviews : Gives us an idea related to the number of ratings that a course has received.\nnum_ published_lectures : Shows the number of lectures the course offers.\nnum_ published_ practice_tests : Gives an idea of the number of practice tests that a course offers.\ncreated :  The time of creation of the course.\npublished_time : Time of publishing the course.\ndiscounted_ price_amount :  The discounted price which a certain course is being offered at.\ndiscounted_ price_currency :  The currency corresponding to the discounted price which a certain course is being offered at.\nprice_ detail_amount : The original price of a particular course.\nprice_ detail_currency : The currency corresponding to the price detail amount for a course.",
    "description_version": "1",
    "file_id": "22102592",
    "format": "arff",
    "id": "43767",
    "language": "English",
    "licence": "CC0: Public Domain",
    "md5_checksum": "5238994a56a6a1c863fcb390b1c7ba25",
    "minio_url": "https://data.openml.org/datasets/0004/43767/dataset_43767.pq",
    "name": "Development-Category-(10k-courses)-from-Udemy",
    "parquet_url": "https://data.openml.org/datasets/0004/43767/dataset_43767.pq",
    "processing_date": "2022-03-24 10:20:08",
    "status": "active",
    "upload_date": "2022-03-24T10:19:17",
    "url": "https://api.openml.org/data/v1/download/22102592/Development-Category-(10k-courses)-from-Udemy.arff",
    "version": "1",
    "version_label": "v1.0",
    "visibility": "public"
  }
}