{
  "data_set_description": {
    "collection_date": "01-07-2020",
    "description": "About Dataset\nThis data set includes15K Fifa20 Players with 15+ features and their images , including their position, age, and Country, and many more. It can be used for learning Statistics, Performing Data Analysis, and Data Visualization using various libraries like Seaborn, Pandas-Bokeh, and Plotly. It can be used to plot various Plots to understand the comparison between various features.\nReferences\n\nSofifa.com",
    "description_version": "1",
    "file_id": "22102591",
    "format": "arff",
    "id": "43766",
    "ignore_attribute": "Image",
    "language": "English",
    "licence": "CC0: Public Domain",
    "md5_checksum": "0ac755c1ebdd7b53785de223c88418a4",
    "minio_url": "https://data.openml.org/datasets/0004/43766/dataset_43766.pq",
    "name": "FIFA20-Players-Dataset-with-Stats--Images",
    "parquet_url": "https://data.openml.org/datasets/0004/43766/dataset_43766.pq",
    "processing_date": "2022-03-24 07:54:29",
    "status": "active",
    "upload_date": "2022-03-24T07:53:38",
    "url": "https://api.openml.org/data/v1/download/22102591/FIFA20-Players-Dataset-with-Stats--Images.arff",
    "version": "1",
    "version_label": "v1.0",
    "visibility": "public"
  }
}