{
  "data_qualities": {
    "quality": [
      {
        "name": "AutoCorrelation",
        "value": []
      },
      {
        "name": "Dimensionality",
        "value": "3.806371534960695E-4"
      },
      {
        "name": "MajorityClassPercentage",
        "value": []
      },
      {
        "name": "MajorityClassSize",
        "value": []
      },
      {
        "name": "MinorityClassPercentage",
        "value": []
      },
      {
        "name": "MinorityClassSize",
        "value": []
      },
      {
        "name": "NumberOfBinaryFeatures",
        "value": "0.0"
      },
      {
        "name": "NumberOfClasses",
        "value": []
      },
      {
        "name": "NumberOfFeatures",
        "value": "23.0"
      },
      {
        "name": "NumberOfInstances",
        "value": "60425.0"
      },
      {
        "name": "NumberOfInstancesWithMissingValues",
        "value": "51230.0"
      },
      {
        "name": "NumberOfMissingValues",
        "value": "178594.0"
      },
      {
        "name": "NumberOfNumericFeatures",
        "value": "4.0"
      },
      {
        "name": "NumberOfSymbolicFeatures",
        "value": "0.0"
      },
      {
        "name": "PercentageOfBinaryFeatures",
        "value": "0.0"
      },
      {
        "name": "PercentageOfInstancesWithMissingValues",
        "value": "84.7827885808854"
      },
      {
        "name": "PercentageOfMissingValues",
        "value": "12.850569336763146"
      },
      {
        "name": "PercentageOfNumericFeatures",
        "value": "17.391304347826086"
      },
      {
        "name": "PercentageOfSymbolicFeatures",
        "value": "0.0"
      }
    ]
  }
}